mesos-reviews mailing list archives

Site index · List index
Message view « Date » · « Thread »
Top « Date » · « Thread »
From Mesos Reviewbot Windows <revi...@mesos.apache.org>
Subject Re: Review Request 65126: Added a resource provider test case.
Date Fri, 12 Jan 2018 14:38:52 GMT

-----------------------------------------------------------
This is an automatically generated e-mail. To reply, visit:
https://reviews.apache.org/r/65126/#review195321
-----------------------------------------------------------



FAIL: mesos-java failed to build.

Reviews applied: `['65125', '65126']`

Failed command: `cmake.exe --build . --target mesos-java`

All the build artifacts available at: http://dcos-win.westus.cloudapp.azure.com/mesos-build/review/65126

Relevant logs:

- [mesos-java-build-cmake-stdout.log](http://dcos-win.westus.cloudapp.azure.com/mesos-build/review/65126/logs/mesos-java-build-cmake-stdout.log):

```
  D:\DCOS\mesos\3rdparty\zookeeper-3.4.8\src\zookeeper-3.4.8\src\c\src\zookeeper.c(2601):
warning C4267: '=': conversion from 'size_t' to 'int', possible loss of data [D:\DCOS\mesos\3rdparty\zookeeper-3.4.8\src\zookeeper-3.4.8-build\zookeeper.vcxproj]
[D:\DCOS\mesos\3rdparty\zookeeper-3.4.8.vcxproj]
  D:\DCOS\mesos\3rdparty\zookeeper-3.4.8\src\zookeeper-3.4.8\src\c\src\zookeeper.c(3091):
warning C4267: 'initializing': conversion from 'size_t' to 'int', possible loss of data [D:\DCOS\mesos\3rdparty\zookeeper-3.4.8\src\zookeeper-3.4.8-build\zookeeper.vcxproj]
[D:\DCOS\mesos\3rdparty\zookeeper-3.4.8.vcxproj]
  D:\DCOS\mesos\3rdparty\zookeeper-3.4.8\src\zookeeper-3.4.8\src\c\src\zookeeper.c(3426):
warning C4996: 'strerror': This function or variable may be unsafe. Consider using strerror_s
instead. To disable deprecation, use _CRT_SECURE_NO_WARNINGS. See online help for details.
[D:\DCOS\mesos\3rdparty\zookeeper-3.4.8\src\zookeeper-3.4.8-build\zookeeper.vcxproj] [D:\DCOS\mesos\3rdparty\zookeeper-3.4.8.vcxproj]
  D:\DCOS\mesos\3rdparty\zookeeper-3.4.8\src\zookeeper-3.4.8\src\c\src\zookeeper.c(3500):
warning C4996: 'inet_ntoa': Use inet_ntop() or InetNtop() instead or define _WINSOCK_DEPRECATED_NO_WARNINGS
to disable deprecated API warnings [D:\DCOS\mesos\3rdparty\zookeeper-3.4.8\src\zookeeper-3.4.8-build\zookeeper.vcxproj]
[D:\DCOS\mesos\3rdparty\zookeeper-3.4.8.vcxproj]
  D:\DCOS\mesos\3rdparty\zookeeper-3.4.8\src\zookeeper-3.4.8\src\c\src\zookeeper.c(3501):
warning C4996: 'sprintf': This function or variable may be unsafe. Consider using sprintf_s
instead. To disable deprecation, use _CRT_SECURE_NO_WARNINGS. See online help for details.
[D:\DCOS\mesos\3rdparty\zookeeper-3.4.8\src\zookeeper-3.4.8-build\zookeeper.vcxproj] [D:\DCOS\mesos\3rdparty\zookeeper-3.4.8.vcxproj]
  D:\DCOS\mesos\3rdparty\zookeeper-3.4.8\src\zookeeper-3.4.8\src\c\src\zookeeper.c(3479):
warning C4101: 'addrstr': unreferenced local variable [D:\DCOS\mesos\3rdparty\zookeeper-3.4.8\src\zookeeper-3.4.8-build\zookeeper.vcxproj]
[D:\DCOS\mesos\3rdparty\zookeeper-3.4.8.vcxproj]
  D:\DCOS\mesos\3rdparty\zookeeper-3.4.8\src\zookeeper-3.4.8\src\c\src\cli.c(124): warning
C4996: 'fopen': This function or variable may be unsafe. Consider using fopen_s instead. To
disable deprecation, use _CRT_SECURE_NO_WARNINGS. See online help for details. [D:\DCOS\mesos\3rdparty\zookeeper-3.4.8\src\zookeeper-3.4.8-build\cli.vcxproj]
[D:\DCOS\mesos\3rdparty\zookeeper-3.4.8.vcxproj]
  D:\DCOS\mesos\3rdparty\zookeeper-3.4.8\src\zookeeper-3.4.8\src\c\src\cli.c(128): warning
C4267: 'initializing': conversion from 'size_t' to 'int', possible loss of data [D:\DCOS\mesos\3rdparty\zookeeper-3.4.8\src\zookeeper-3.4.8-build\cli.vcxproj]
[D:\DCOS\mesos\3rdparty\zookeeper-3.4.8.vcxproj]
  D:\DCOS\mesos\3rdparty\zookeeper-3.4.8\src\zookeeper-3.4.8\src\c\src\cli.c(279): warning
C4267: 'function': conversion from 'size_t' to 'int', possible loss of data [D:\DCOS\mesos\3rdparty\zookeeper-3.4.8\src\zookeeper-3.4.8-build\cli.vcxproj]
[D:\DCOS\mesos\3rdparty\zookeeper-3.4.8.vcxproj]
  D:\DCOS\mesos\3rdparty\zookeeper-3.4.8\src\zookeeper-3.4.8\src\c\src\cli.c(301): warning
C4267: 'initializing': conversion from 'size_t' to 'int', possible loss of data [D:\DCOS\mesos\3rdparty\zookeeper-3.4.8\src\zookeeper-3.4.8-build\cli.vcxproj]
[D:\DCOS\mesos\3rdparty\zookeeper-3.4.8.vcxproj]
  D:\DCOS\mesos\3rdparty\zookeeper-3.4.8\src\zookeeper-3.4.8\src\c\src\cli.c(368): warning
C4267: 'function': conversion from 'size_t' to 'int', possible loss of data [D:\DCOS\mesos\3rdparty\zookeeper-3.4.8\src\zookeeper-3.4.8-build\cli.vcxproj]
[D:\DCOS\mesos\3rdparty\zookeeper-3.4.8.vcxproj]
  D:\DCOS\mesos\3rdparty\zookeeper-3.4.8\src\zookeeper-3.4.8\src\c\src\cli.c(372): warning
C4267: 'function': conversion from 'size_t' to 'int', possible loss of data [D:\DCOS\mesos\3rdparty\zookeeper-3.4.8\src\zookeeper-3.4.8-build\cli.vcxproj]
[D:\DCOS\mesos\3rdparty\zookeeper-3.4.8.vcxproj]
  D:\DCOS\mesos\3rdparty\zookeeper-3.4.8\src\zookeeper-3.4.8\src\c\src\cli.c(512): warning
C4267: 'function': conversion from 'size_t' to 'int', possible loss of data [D:\DCOS\mesos\3rdparty\zookeeper-3.4.8\src\zookeeper-3.4.8-build\cli.vcxproj]
[D:\DCOS\mesos\3rdparty\zookeeper-3.4.8.vcxproj]
  D:\DCOS\mesos\3rdparty\zookeeper-3.4.8\src\zookeeper-3.4.8\src\c\src\cli.c(543): warning
C4996: 'strcpy': This function or variable may be unsafe. Consider using strcpy_s instead.
To disable deprecation, use _CRT_SECURE_NO_WARNINGS. See online help for details. [D:\DCOS\mesos\3rdparty\zookeeper-3.4.8\src\zookeeper-3.4.8-build\cli.vcxproj]
[D:\DCOS\mesos\3rdparty\zookeeper-3.4.8.vcxproj]
  D:\DCOS\mesos\3rdparty\zookeeper-3.4.8\src\zookeeper-3.4.8\src\c\src\cli.c(548): warning
C4996: 'fopen': This function or variable may be unsafe. Consider using fopen_s instead. To
disable deprecation, use _CRT_SECURE_NO_WARNINGS. See online help for details. [D:\DCOS\mesos\3rdparty\zookeeper-3.4.8\src\zookeeper-3.4.8-build\cli.vcxproj]
[D:\DCOS\mesos\3rdparty\zookeeper-3.4.8.vcxproj]
  D:\DCOS\mesos\3rdparty\zookeeper-3.4.8\src\zookeeper-3.4.8\src\c\src\cli.c(569): warning
C4996: 'strcpy': This function or variable may be unsafe. Consider using strcpy_s instead.
To disable deprecation, use _CRT_SECURE_NO_WARNINGS. See online help for details. [D:\DCOS\mesos\3rdparty\zookeeper-3.4.8\src\zookeeper-3.4.8-build\cli.vcxproj]
[D:\DCOS\mesos\3rdparty\zookeeper-3.4.8.vcxproj]


"D:\DCOS\mesos\src\java\mesos-java.vcxproj" (default target) (1) ->
"D:\DCOS\mesos\3rdparty\libprocess\src\process.vcxproj" (default target) (19) ->
(ClCompile target) -> 
  D:\DCOS\mesos\mesos\3rdparty\libprocess\src\time.cpp(116): fatal error C1088: Cannot flush
compiler intermediate file: 'C:\Users\mesos\AppData\Local\Temp_CL_b51306d1gl': No space left
on device [D:\DCOS\mesos\3rdparty\libprocess\src\process.vcxproj]
  D:\DCOS\mesos\mesos\3rdparty\libprocess\src\poll_socket.cpp(279): fatal error C1088: Cannot
flush compiler intermediate file: 'C:\Users\mesos\AppData\Local\Temp_CL_5195cab7gl': No space
left on device [D:\DCOS\mesos\3rdparty\libprocess\src\process.vcxproj]
  D:\DCOS\mesos\mesos\3rdparty\libprocess\src\subprocess_windows.cpp(241): fatal error C1088:
Cannot flush compiler intermediate file: 'C:\Users\mesos\AppData\Local\Temp_CL_80e16bf8gl':
No space left on device [D:\DCOS\mesos\3rdparty\libprocess\src\process.vcxproj]

    199 Warning(s)
    3 Error(s)

Time Elapsed 00:17:39.65
```

- [mesos-java-build-CMakeOutput.log](http://dcos-win.westus.cloudapp.azure.com/mesos-build/review/65126/logs/mesos-java-build-CMakeOutput.log):

```
  Creating directory "cmTC_bd721.dir\Debug\".

  Creating directory "D:\DCOS\mesos\CMakeFiles\CMakeTmp\Debug\".

  Creating directory "cmTC_bd721.dir\Debug\cmTC_bd721.tlog\".

InitializeBuildStatus:

  Creating "cmTC_bd721.dir\Debug\cmTC_bd721.tlog\unsuccessfulbuild" because "AlwaysCreate"
was specified.

ClCompile:

  C:\Program Files (x86)\Microsoft Visual Studio\2017\Community\VC\Tools\MSVC\14.12.25827\bin\HostX64\x64\CL.exe
/c /Zi /W3 /WX- /diagnostics:classic /Od /Ob0 /D WIN32 /D _WINDOWS /D COMPILER_SUPPORTS_CXX11
/D "CMAKE_INTDIR=\"Debug\"" /D _MBCS /Gm- /EHsc /RTC1 /MDd /GS /fp:precise /Zc:wchar_t /Zc:forScope
/Zc:inline /GR /Fo"cmTC_bd721.dir\Debug\" /Fd"cmTC_bd721.dir\Debug\vc141.pdb" /Gd /TP /errorReport:queue
D:\DCOS\mesos\CMakeFiles\CMakeTmp\src.cxx

  Microsoft (R) C/C++ Optimizing Compiler Version 19.12.25830.2 for x64

  Copyright (C) Microsoft Corporation.  All rights reserved.

  

  cl /c /Zi /W3 /WX- /diagnostics:classic /Od /Ob0 /D WIN32 /D _WINDOWS /D COMPILER_SUPPORTS_CXX11
/D "CMAKE_INTDIR=\"Debug\"" /D _MBCS /Gm- /EHsc /RTC1 /MDd /GS /fp:precise /Zc:wchar_t /Zc:forScope
/Zc:inline /GR /Fo"cmTC_bd721.dir\Debug\" /Fd"cmTC_bd721.dir\Debug\vc141.pdb" /Gd /TP /errorReport:queue
D:\DCOS\mesos\CMakeFiles\CMakeTmp\src.cxx

  src.cxx

  

Link:

  C:\Program Files (x86)\Microsoft Visual Studio\2017\Community\VC\Tools\MSVC\14.12.25827\bin\HostX64\x64\link.exe
/ERRORREPORT:QUEUE /OUT:"D:\DCOS\mesos\CMakeFiles\CMakeTmp\Debug\cmTC_bd721.exe" /INCREMENTAL
/NOLOGO kernel32.lib user32.lib gdi32.lib winspool.lib shell32.lib ole32.lib oleaut32.lib
uuid.lib comdlg32.lib advapi32.lib /MANIFEST /MANIFESTUAC:"level='asInvoker' uiAccess='false'"
/manifest:embed /DEBUG /PDB:"D:/DCOS/mesos/CMakeFiles/CMakeTmp/Debug/cmTC_bd721.pdb" /SUBSYSTEM:CONSOLE
/TLBID:1 /DYNAMICBASE /NXCOMPAT /IMPLIB:"D:/DCOS/mesos/CMakeFiles/CMakeTmp/Debug/cmTC_bd721.lib"
/MACHINE:X64  /machine:x64 cmTC_bd721.dir\Debug\src.obj

  cmTC_bd721.vcxproj -> D:\DCOS\mesos\CMakeFiles\CMakeTmp\Debug\cmTC_bd721.exe

FinalizeBuildStatus:

  Deleting file "cmTC_bd721.dir\Debug\cmTC_bd721.tlog\unsuccessfulbuild".

  Touching "cmTC_bd721.dir\Debug\cmTC_bd721.tlog\cmTC_bd721.lastbuildstate".

Done Building Project "D:\DCOS\mesos\CMakeFiles\CMakeTmp\cmTC_bd721.vcxproj" (default targets).



Build succeeded.

    0 Warning(s)

    0 Error(s)



Time Elapsed 00:00:01.22


Source file was:
int main() { return 0; }
```

- [mesos-java-build-CMakeError.log](http://dcos-win.westus.cloudapp.azure.com/mesos-build/review/65126/logs/mesos-java-build-CMakeError.log):

```
PrepareForBuild:

  Creating directory "cmTC_cb956.dir\Debug\".

  Creating directory "D:\DCOS\mesos\CMakeFiles\CMakeTmp\Debug\".

  Creating directory "cmTC_cb956.dir\Debug\cmTC_cb956.tlog\".

InitializeBuildStatus:

  Creating "cmTC_cb956.dir\Debug\cmTC_cb956.tlog\unsuccessfulbuild" because "AlwaysCreate"
was specified.

ClCompile:

  C:\Program Files (x86)\Microsoft Visual Studio\2017\Community\VC\Tools\MSVC\14.12.25827\bin\HostX64\x64\CL.exe
/c /Zi /W3 /WX- /diagnostics:classic /MP /Od /Ob0 /D WIN32 /D _WINDOWS /D UNICODE /D _UNICODE
/D "CMAKE_INTDIR=\"Debug\"" /D _UNICODE /D UNICODE /Gm- /RTC1 /MTd /GS /fp:precise /Zc:wchar_t
/Zc:forScope /Zc:inline /Fo"cmTC_cb956.dir\Debug\" /Fd"cmTC_cb956.dir\Debug\vc141.pdb" /Gd
/TC /errorReport:queue D:\DCOS\mesos\CMakeFiles\CMakeTmp\CheckIncludeFile.c

  Microsoft (R) C/C++ Optimizing Compiler Version 19.12.25830.2 for x64

  Copyright (C) Microsoft Corporation.  All rights reserved.

  

  cl /c /Zi /W3 /WX- /diagnostics:classic /MP /Od /Ob0 /D WIN32 /D _WINDOWS /D UNICODE /D
_UNICODE /D "CMAKE_INTDIR=\"Debug\"" /D _UNICODE /D UNICODE /Gm- /RTC1 /MTd /GS /fp:precise
/Zc:wchar_t /Zc:forScope /Zc:inline /Fo"cmTC_cb956.dir\Debug\" /Fd"cmTC_cb956.dir\Debug\vc141.pdb"
/Gd /TC /errorReport:queue D:\DCOS\mesos\CMakeFiles\CMakeTmp\CheckIncludeFile.c

  CheckIncludeFile.c

  

D:\DCOS\mesos\CMakeFiles\CMakeTmp\CheckIncludeFile.c(1): fatal error C1083: Cannot open include
file: 'pthread.h': No such file or directory [D:\DCOS\mesos\CMakeFiles\CMakeTmp\cmTC_cb956.vcxproj]

Done Building Project "D:\DCOS\mesos\CMakeFiles\CMakeTmp\cmTC_cb956.vcxproj" (default targets)
-- FAILED.



Build FAILED.



"D:\DCOS\mesos\CMakeFiles\CMakeTmp\cmTC_cb956.vcxproj" (default target) (1) ->

(ClCompile target) -> 

  D:\DCOS\mesos\CMakeFiles\CMakeTmp\CheckIncludeFile.c(1): fatal error C1083: Cannot open
include file: 'pthread.h': No such file or directory [D:\DCOS\mesos\CMakeFiles\CMakeTmp\cmTC_cb956.vcxproj]



    0 Warning(s)

    1 Error(s)



Time Elapsed 00:00:00.62



```

- Mesos Reviewbot Windows


On Jan. 12, 2018, 2:16 p.m., Jan Schlicht wrote:
> 
> -----------------------------------------------------------
> This is an automatically generated e-mail. To reply, visit:
> https://reviews.apache.org/r/65126/
> -----------------------------------------------------------
> 
> (Updated Jan. 12, 2018, 2:16 p.m.)
> 
> 
> Review request for mesos, Benjamin Bannier and Jie Yu.
> 
> 
> Repository: mesos
> 
> 
> Description
> -------
> 
> Added a resource provider test case.
> 
> 
> Diffs
> -----
> 
>   src/tests/resource_provider_manager_tests.cpp d80823c47963e969113dae3623b18b7639c890fc

> 
> 
> Diff: https://reviews.apache.org/r/65126/diff/1/
> 
> 
> Testing
> -------
> 
> make check
> 
> 
> Thanks,
> 
> Jan Schlicht
> 
>


Mime
  • Unnamed multipart/alternative (inline, None, 0 bytes)
View raw message