mesos-reviews mailing list archives

Site index · List index
Message view « Date » · « Thread »
Top « Date » · « Thread »
From Mesos Reviewbot Windows <revi...@mesos.apache.org>
Subject Re: Review Request 65103: Updated quota documentation.
Date Fri, 12 Jan 2018 01:15:16 GMT

-----------------------------------------------------------
This is an automatically generated e-mail. To reply, visit:
https://reviews.apache.org/r/65103/#review195278
-----------------------------------------------------------



FAIL: mesos-java failed to build.

Reviews applied: `['65103']`

Failed command: `cmake.exe --build . --target mesos-java`

All the build artifacts available at: http://dcos-win.westus.cloudapp.azure.com/mesos-build/review/65103

Relevant logs:

- [mesos-java-build-cmake-stdout.log](http://dcos-win.westus.cloudapp.azure.com/mesos-build/review/65103/logs/mesos-java-build-cmake-stdout.log):

```
  CUSTOMBUILD : CMake warning :  [D:\DCOS\mesos\3rdparty\libevent-2.1.5-beta.vcxproj]


"D:\DCOS\mesos\src\java\mesos-java.vcxproj" (default target) (1) ->
"D:\DCOS\mesos\3rdparty\libprocess\src\process.vcxproj" (default target) (19) ->
"D:\DCOS\mesos\3rdparty\zlib-1.2.8.vcxproj" (default target) (20) ->
  CUSTOMBUILD : CMake warning :  [D:\DCOS\mesos\3rdparty\zlib-1.2.8.vcxproj]


"D:\DCOS\mesos\src\java\mesos-java.vcxproj" (default target) (1) ->
"D:\DCOS\mesos\3rdparty\libprocess\src\process.vcxproj" (default target) (19) ->
(ClCompile target) -> 
  D:\DCOS\mesos\mesos\3rdparty\libprocess\src\http.cpp(2169): warning C4267: 'argument': conversion
from 'size_t' to 'int', possible loss of data [D:\DCOS\mesos\3rdparty\libprocess\src\process.vcxproj]
  D:\DCOS\mesos\mesos\3rdparty\libprocess\src\process.cpp(410): warning C4267: 'return': conversion
from 'size_t' to 'long', possible loss of data [D:\DCOS\mesos\3rdparty\libprocess\src\process.vcxproj]
  D:\DCOS\mesos\mesos\3rdparty\libprocess\src\jwt.cpp(144): warning C4244: 'initializing':
conversion from 'double' to 'int64_t', possible loss of data [D:\DCOS\mesos\3rdparty\libprocess\src\process.vcxproj]
  D:\DCOS\mesos\mesos\3rdparty\libprocess\src\jwt.cpp(144): warning C4244: 'initializing':
conversion from 'double' to 'const int64_t', possible loss of data [D:\DCOS\mesos\3rdparty\libprocess\src\process.vcxproj]
  D:\DCOS\mesos\mesos\3rdparty\libprocess\src\ssl\utilities.cpp(363): warning C4267: 'argument':
conversion from 'size_t' to 'int', possible loss of data [D:\DCOS\mesos\3rdparty\libprocess\src\process.vcxproj]
  D:\DCOS\mesos\mesos\3rdparty\libprocess\src\libevent_ssl_socket.cpp(595): warning C4267:
'argument': conversion from 'size_t' to 'int', possible loss of data [D:\DCOS\mesos\3rdparty\libprocess\src\process.vcxproj]


"D:\DCOS\mesos\src\java\mesos-java.vcxproj" (default target) (1) ->
"D:\DCOS\mesos\3rdparty\zookeeper-3.4.8.vcxproj" (default target) (21) ->
(CustomBuild target) -> 
  C:\Program Files (x86)\Microsoft Visual Studio\2017\Community\Common7\IDE\VC\VCTargets\Microsoft.CppCommon.targets(171,5):
error MSB6006: "cmd.exe" exited with code 9009. [D:\DCOS\mesos\3rdparty\zookeeper-3.4.8.vcxproj]

    139 Warning(s)
    1 Error(s)

Time Elapsed 00:17:06.37
```

- [mesos-java-build-CMakeOutput.log](http://dcos-win.westus.cloudapp.azure.com/mesos-build/review/65103/logs/mesos-java-build-CMakeOutput.log):

```
  Creating directory "cmTC_4df16.dir\Debug\".

  Creating directory "D:\DCOS\mesos\CMakeFiles\CMakeTmp\Debug\".

  Creating directory "cmTC_4df16.dir\Debug\cmTC_4df16.tlog\".

InitializeBuildStatus:

  Creating "cmTC_4df16.dir\Debug\cmTC_4df16.tlog\unsuccessfulbuild" because "AlwaysCreate"
was specified.

ClCompile:

  C:\Program Files (x86)\Microsoft Visual Studio\2017\Community\VC\Tools\MSVC\14.12.25827\bin\HostX64\x64\CL.exe
/c /Zi /W3 /WX- /diagnostics:classic /Od /Ob0 /D WIN32 /D _WINDOWS /D COMPILER_SUPPORTS_CXX11
/D "CMAKE_INTDIR=\"Debug\"" /D _MBCS /Gm- /EHsc /RTC1 /MDd /GS /fp:precise /Zc:wchar_t /Zc:forScope
/Zc:inline /GR /Fo"cmTC_4df16.dir\Debug\" /Fd"cmTC_4df16.dir\Debug\vc141.pdb" /Gd /TP /errorReport:queue
D:\DCOS\mesos\CMakeFiles\CMakeTmp\src.cxx

  Microsoft (R) C/C++ Optimizing Compiler Version 19.12.25830.2 for x64

  Copyright (C) Microsoft Corporation.  All rights reserved.

  

  cl /c /Zi /W3 /WX- /diagnostics:classic /Od /Ob0 /D WIN32 /D _WINDOWS /D COMPILER_SUPPORTS_CXX11
/D "CMAKE_INTDIR=\"Debug\"" /D _MBCS /Gm- /EHsc /RTC1 /MDd /GS /fp:precise /Zc:wchar_t /Zc:forScope
/Zc:inline /GR /Fo"cmTC_4df16.dir\Debug\" /Fd"cmTC_4df16.dir\Debug\vc141.pdb" /Gd /TP /errorReport:queue
D:\DCOS\mesos\CMakeFiles\CMakeTmp\src.cxx

  src.cxx

  

Link:

  C:\Program Files (x86)\Microsoft Visual Studio\2017\Community\VC\Tools\MSVC\14.12.25827\bin\HostX64\x64\link.exe
/ERRORREPORT:QUEUE /OUT:"D:\DCOS\mesos\CMakeFiles\CMakeTmp\Debug\cmTC_4df16.exe" /INCREMENTAL
/NOLOGO kernel32.lib user32.lib gdi32.lib winspool.lib shell32.lib ole32.lib oleaut32.lib
uuid.lib comdlg32.lib advapi32.lib /MANIFEST /MANIFESTUAC:"level='asInvoker' uiAccess='false'"
/manifest:embed /DEBUG /PDB:"D:/DCOS/mesos/CMakeFiles/CMakeTmp/Debug/cmTC_4df16.pdb" /SUBSYSTEM:CONSOLE
/TLBID:1 /DYNAMICBASE /NXCOMPAT /IMPLIB:"D:/DCOS/mesos/CMakeFiles/CMakeTmp/Debug/cmTC_4df16.lib"
/MACHINE:X64  /machine:x64 cmTC_4df16.dir\Debug\src.obj

  cmTC_4df16.vcxproj -> D:\DCOS\mesos\CMakeFiles\CMakeTmp\Debug\cmTC_4df16.exe

FinalizeBuildStatus:

  Deleting file "cmTC_4df16.dir\Debug\cmTC_4df16.tlog\unsuccessfulbuild".

  Touching "cmTC_4df16.dir\Debug\cmTC_4df16.tlog\cmTC_4df16.lastbuildstate".

Done Building Project "D:\DCOS\mesos\CMakeFiles\CMakeTmp\cmTC_4df16.vcxproj" (default targets).



Build succeeded.

    0 Warning(s)

    0 Error(s)



Time Elapsed 00:00:01.20


Source file was:
int main() { return 0; }
```

- [mesos-java-build-CMakeError.log](http://dcos-win.westus.cloudapp.azure.com/mesos-build/review/65103/logs/mesos-java-build-CMakeError.log):

```
PrepareForBuild:

  Creating directory "cmTC_4898c.dir\Debug\".

  Creating directory "D:\DCOS\mesos\CMakeFiles\CMakeTmp\Debug\".

  Creating directory "cmTC_4898c.dir\Debug\cmTC_4898c.tlog\".

InitializeBuildStatus:

  Creating "cmTC_4898c.dir\Debug\cmTC_4898c.tlog\unsuccessfulbuild" because "AlwaysCreate"
was specified.

ClCompile:

  C:\Program Files (x86)\Microsoft Visual Studio\2017\Community\VC\Tools\MSVC\14.12.25827\bin\HostX64\x64\CL.exe
/c /Zi /W3 /WX- /diagnostics:classic /MP /Od /Ob0 /D WIN32 /D _WINDOWS /D UNICODE /D _UNICODE
/D "CMAKE_INTDIR=\"Debug\"" /D _UNICODE /D UNICODE /Gm- /RTC1 /MTd /GS /fp:precise /Zc:wchar_t
/Zc:forScope /Zc:inline /Fo"cmTC_4898c.dir\Debug\" /Fd"cmTC_4898c.dir\Debug\vc141.pdb" /Gd
/TC /errorReport:queue D:\DCOS\mesos\CMakeFiles\CMakeTmp\CheckIncludeFile.c

  Microsoft (R) C/C++ Optimizing Compiler Version 19.12.25830.2 for x64

  Copyright (C) Microsoft Corporation.  All rights reserved.

  

  cl /c /Zi /W3 /WX- /diagnostics:classic /MP /Od /Ob0 /D WIN32 /D _WINDOWS /D UNICODE /D
_UNICODE /D "CMAKE_INTDIR=\"Debug\"" /D _UNICODE /D UNICODE /Gm- /RTC1 /MTd /GS /fp:precise
/Zc:wchar_t /Zc:forScope /Zc:inline /Fo"cmTC_4898c.dir\Debug\" /Fd"cmTC_4898c.dir\Debug\vc141.pdb"
/Gd /TC /errorReport:queue D:\DCOS\mesos\CMakeFiles\CMakeTmp\CheckIncludeFile.c

  CheckIncludeFile.c

  

D:\DCOS\mesos\CMakeFiles\CMakeTmp\CheckIncludeFile.c(1): fatal error C1083: Cannot open include
file: 'pthread.h': No such file or directory [D:\DCOS\mesos\CMakeFiles\CMakeTmp\cmTC_4898c.vcxproj]

Done Building Project "D:\DCOS\mesos\CMakeFiles\CMakeTmp\cmTC_4898c.vcxproj" (default targets)
-- FAILED.



Build FAILED.



"D:\DCOS\mesos\CMakeFiles\CMakeTmp\cmTC_4898c.vcxproj" (default target) (1) ->

(ClCompile target) -> 

  D:\DCOS\mesos\CMakeFiles\CMakeTmp\CheckIncludeFile.c(1): fatal error C1083: Cannot open
include file: 'pthread.h': No such file or directory [D:\DCOS\mesos\CMakeFiles\CMakeTmp\cmTC_4898c.vcxproj]



    0 Warning(s)

    1 Error(s)



Time Elapsed 00:00:00.55



```

- Mesos Reviewbot Windows


On Jan. 12, 2018, 12:30 a.m., Meng Zhu wrote:
> 
> -----------------------------------------------------------
> This is an automatically generated e-mail. To reply, visit:
> https://reviews.apache.org/r/65103/
> -----------------------------------------------------------
> 
> (Updated Jan. 12, 2018, 12:30 a.m.)
> 
> 
> Review request for mesos and Benjamin Mahler.
> 
> 
> Repository: mesos
> 
> 
> Description
> -------
> 
> Updated quota documentation regarding allocation granularity.
> 
> 
> Diffs
> -----
> 
>   docs/quota.md 9d1a9d2abbdd261aed5707c41ac09fc9e29ff9ab 
> 
> 
> Diff: https://reviews.apache.org/r/65103/diff/1/
> 
> 
> Testing
> -------
> 
> 
> Thanks,
> 
> Meng Zhu
> 
>


Mime
  • Unnamed multipart/alternative (inline, None, 0 bytes)
View raw message