mesos-reviews mailing list archives

Site index · List index
Message view « Date » · « Thread »
Top « Date » · « Thread »
From Mesos Reviewbot Windows <revi...@mesos.apache.org>
Subject Re: Review Request 65031: Replaced `convertResourceFormat` with `downgradeResources` accordingly.
Date Thu, 11 Jan 2018 19:56:30 GMT

-----------------------------------------------------------
This is an automatically generated e-mail. To reply, visit:
https://reviews.apache.org/r/65031/#review195247
-----------------------------------------------------------



FAIL: Mesos tests failed to build.

Reviews applied: `['65026', '65030', '65031']`

Failed command: `cmake.exe --build . --target mesos-tests --config Debug`

All the build artifacts available at: http://dcos-win.westus.cloudapp.azure.com/mesos-build/review/65031

Relevant logs:

- [mesos-tests-build-cmake-stdout.log](http://dcos-win.westus.cloudapp.azure.com/mesos-build/review/65031/logs/mesos-tests-build-cmake-stdout.log):

```
  D:\DCOS\mesos\mesos\src\authentication\cram_md5\authenticatee.cpp(75): warning C4267: '=':
conversion from 'size_t' to 'unsigned long', possible loss of data [D:\DCOS\mesos\src\mesos.vcxproj]
  D:\DCOS\mesos\mesos\src\authentication\cram_md5\authenticatee.cpp(271): warning C4267: 'argument':
conversion from 'size_t' to 'unsigned int', possible loss of data [D:\DCOS\mesos\src\mesos.vcxproj]
  D:\DCOS\mesos\mesos\src\authentication\cram_md5\authenticatee.cpp(333): warning C4267: '=':
conversion from 'size_t' to 'unsigned int', possible loss of data [D:\DCOS\mesos\src\mesos.vcxproj]
  D:\DCOS\mesos\mesos\src\authentication\cram_md5\authenticator.cpp(216): warning C4267: 'argument':
conversion from 'size_t' to 'unsigned int', possible loss of data [D:\DCOS\mesos\src\mesos.vcxproj]
  D:\DCOS\mesos\mesos\src\authentication\cram_md5\authenticator.cpp(242): warning C4267: 'argument':
conversion from 'size_t' to 'unsigned int', possible loss of data [D:\DCOS\mesos\src\mesos.vcxproj]
  D:\DCOS\mesos\mesos\src\authentication\cram_md5\authenticator.cpp(274): warning C4267: '=':
conversion from 'size_t' to 'unsigned int', possible loss of data [D:\DCOS\mesos\src\mesos.vcxproj]
  D:\DCOS\mesos\mesos\src\master/master.hpp(2090): warning C4244: 'return': conversion from
'unsigned __int64' to 'double', possible loss of data (compiling source file D:\DCOS\mesos\mesos\src\common\protobuf_utils.cpp)
[D:\DCOS\mesos\src\mesos.vcxproj]
  D:\DCOS\mesos\mesos\src\files\files.cpp(704): warning C4267: 'argument': conversion from
'size_t' to 'off_t', possible loss of data [D:\DCOS\mesos\src\mesos.vcxproj]
  D:\DCOS\mesos\mesos\src\master/master.hpp(2090): warning C4244: 'return': conversion from
'unsigned __int64' to 'double', possible loss of data (compiling source file D:\DCOS\mesos\mesos\src\master\master.cpp)
[D:\DCOS\mesos\src\mesos.vcxproj]
  D:\DCOS\mesos\mesos\src\master/master.hpp(2090): warning C4244: 'return': conversion from
'unsigned __int64' to 'double', possible loss of data (compiling source file D:\DCOS\mesos\mesos\src\master\quota_handler.cpp)
[D:\DCOS\mesos\src\mesos.vcxproj]
  D:\DCOS\mesos\mesos\src\master\master.cpp(6139): warning C4244: 'argument': conversion from
'const ::size_t' to 'double', possible loss of data [D:\DCOS\mesos\src\mesos.vcxproj]
  D:\DCOS\mesos\mesos\src\master\master.cpp(6241): warning C4244: 'argument': conversion from
'const ::size_t' to 'double', possible loss of data [D:\DCOS\mesos\src\mesos.vcxproj]
  D:\DCOS\mesos\mesos\src\master\master.cpp(6800): warning C4244: 'argument': conversion from
'const ::size_t' to 'double', possible loss of data [D:\DCOS\mesos\src\mesos.vcxproj]
  D:\DCOS\mesos\mesos\src\master\master.cpp(8977): warning C4244: 'argument': conversion from
'const ::size_t' to 'double', possible loss of data [D:\DCOS\mesos\src\mesos.vcxproj]
  D:\DCOS\mesos\mesos\src\master\master.cpp(10818): warning C4244: 'return': conversion from
'::size_t' to 'double', possible loss of data [D:\DCOS\mesos\src\mesos.vcxproj]
  D:\DCOS\mesos\mesos\src\master\allocator\sorter\drf\sorter.cpp(589): warning C4267: 'return':
conversion from 'size_t' to 'int', possible loss of data [D:\DCOS\mesos\src\mesos.vcxproj]
  D:\DCOS\mesos\mesos\src\master/master.hpp(2090): warning C4244: 'return': conversion from
'unsigned __int64' to 'double', possible loss of data (compiling source file D:\DCOS\mesos\mesos\src\master\weights_handler.cpp)
[D:\DCOS\mesos\src\mesos.vcxproj]


"D:\DCOS\mesos\src\tests\mesos-tests.vcxproj" (default target) (1) ->
"D:\DCOS\mesos\src\mesos.vcxproj" (default target) (12) ->
(ClCompile target) -> 
  D:\DCOS\mesos\include\mesos/v1/mesos.pb.h(4975): fatal error C1088: Cannot flush compiler
intermediate file: 'C:\Users\mesos\AppData\Local\Temp_CL_c21f360bsy': No space left on device
(compiling source file D:\DCOS\mesos\mesos\src\internal\evolve.cpp) [D:\DCOS\mesos\src\mesos.vcxproj]
  D:\DCOS\mesos\include\mesos/scheduler/scheduler.pb.h(8446): fatal error C1088: Cannot flush
compiler intermediate file: 'C:\Users\mesos\AppData\Local\Temp_CL_9fc4652aex': No space left
on device (compiling source file D:\DCOS\mesos\mesos\src\checks\health_checker.cpp) [D:\DCOS\mesos\src\mesos.vcxproj]

    135 Warning(s)
    2 Error(s)

Time Elapsed 00:03:18.27
```

- [mesos-tests-CMakeOutput.log](http://dcos-win.westus.cloudapp.azure.com/mesos-build/review/65031/logs/mesos-tests-CMakeOutput.log):

```
  Creating directory "cmTC_2abc7.dir\Debug\".

  Creating directory "D:\DCOS\mesos\CMakeFiles\CMakeTmp\Debug\".

  Creating directory "cmTC_2abc7.dir\Debug\cmTC_2abc7.tlog\".

InitializeBuildStatus:

  Creating "cmTC_2abc7.dir\Debug\cmTC_2abc7.tlog\unsuccessfulbuild" because "AlwaysCreate"
was specified.

ClCompile:

  C:\Program Files (x86)\Microsoft Visual Studio\2017\Community\VC\Tools\MSVC\14.12.25827\bin\HostX64\x64\CL.exe
/c /Zi /W3 /WX- /diagnostics:classic /Od /Ob0 /D WIN32 /D _WINDOWS /D COMPILER_SUPPORTS_CXX11
/D "CMAKE_INTDIR=\"Debug\"" /D _MBCS /Gm- /EHsc /RTC1 /MDd /GS /fp:precise /Zc:wchar_t /Zc:forScope
/Zc:inline /GR /Fo"cmTC_2abc7.dir\Debug\" /Fd"cmTC_2abc7.dir\Debug\vc141.pdb" /Gd /TP /errorReport:queue
D:\DCOS\mesos\CMakeFiles\CMakeTmp\src.cxx

  Microsoft (R) C/C++ Optimizing Compiler Version 19.12.25830.2 for x64

  Copyright (C) Microsoft Corporation.  All rights reserved.

  

  cl /c /Zi /W3 /WX- /diagnostics:classic /Od /Ob0 /D WIN32 /D _WINDOWS /D COMPILER_SUPPORTS_CXX11
/D "CMAKE_INTDIR=\"Debug\"" /D _MBCS /Gm- /EHsc /RTC1 /MDd /GS /fp:precise /Zc:wchar_t /Zc:forScope
/Zc:inline /GR /Fo"cmTC_2abc7.dir\Debug\" /Fd"cmTC_2abc7.dir\Debug\vc141.pdb" /Gd /TP /errorReport:queue
D:\DCOS\mesos\CMakeFiles\CMakeTmp\src.cxx

  src.cxx

  

Link:

  C:\Program Files (x86)\Microsoft Visual Studio\2017\Community\VC\Tools\MSVC\14.12.25827\bin\HostX64\x64\link.exe
/ERRORREPORT:QUEUE /OUT:"D:\DCOS\mesos\CMakeFiles\CMakeTmp\Debug\cmTC_2abc7.exe" /INCREMENTAL
/NOLOGO kernel32.lib user32.lib gdi32.lib winspool.lib shell32.lib ole32.lib oleaut32.lib
uuid.lib comdlg32.lib advapi32.lib /MANIFEST /MANIFESTUAC:"level='asInvoker' uiAccess='false'"
/manifest:embed /DEBUG /PDB:"D:/DCOS/mesos/CMakeFiles/CMakeTmp/Debug/cmTC_2abc7.pdb" /SUBSYSTEM:CONSOLE
/TLBID:1 /DYNAMICBASE /NXCOMPAT /IMPLIB:"D:/DCOS/mesos/CMakeFiles/CMakeTmp/Debug/cmTC_2abc7.lib"
/MACHINE:X64  /machine:x64 cmTC_2abc7.dir\Debug\src.obj

  cmTC_2abc7.vcxproj -> D:\DCOS\mesos\CMakeFiles\CMakeTmp\Debug\cmTC_2abc7.exe

FinalizeBuildStatus:

  Deleting file "cmTC_2abc7.dir\Debug\cmTC_2abc7.tlog\unsuccessfulbuild".

  Touching "cmTC_2abc7.dir\Debug\cmTC_2abc7.tlog\cmTC_2abc7.lastbuildstate".

Done Building Project "D:\DCOS\mesos\CMakeFiles\CMakeTmp\cmTC_2abc7.vcxproj" (default targets).



Build succeeded.

    0 Warning(s)

    0 Error(s)



Time Elapsed 00:00:01.20


Source file was:
int main() { return 0; }
```

- [mesos-tests-CMakeError.log](http://dcos-win.westus.cloudapp.azure.com/mesos-build/review/65031/logs/mesos-tests-CMakeError.log):

```
PrepareForBuild:

  Creating directory "cmTC_f5e5c.dir\Debug\".

  Creating directory "D:\DCOS\mesos\CMakeFiles\CMakeTmp\Debug\".

  Creating directory "cmTC_f5e5c.dir\Debug\cmTC_f5e5c.tlog\".

InitializeBuildStatus:

  Creating "cmTC_f5e5c.dir\Debug\cmTC_f5e5c.tlog\unsuccessfulbuild" because "AlwaysCreate"
was specified.

ClCompile:

  C:\Program Files (x86)\Microsoft Visual Studio\2017\Community\VC\Tools\MSVC\14.12.25827\bin\HostX64\x64\CL.exe
/c /Zi /W3 /WX- /diagnostics:classic /MP /Od /Ob0 /D WIN32 /D _WINDOWS /D UNICODE /D _UNICODE
/D "CMAKE_INTDIR=\"Debug\"" /D _UNICODE /D UNICODE /Gm- /RTC1 /MTd /GS /fp:precise /Zc:wchar_t
/Zc:forScope /Zc:inline /Fo"cmTC_f5e5c.dir\Debug\" /Fd"cmTC_f5e5c.dir\Debug\vc141.pdb" /Gd
/TC /errorReport:queue D:\DCOS\mesos\CMakeFiles\CMakeTmp\CheckIncludeFile.c

  Microsoft (R) C/C++ Optimizing Compiler Version 19.12.25830.2 for x64

  Copyright (C) Microsoft Corporation.  All rights reserved.

  

  cl /c /Zi /W3 /WX- /diagnostics:classic /MP /Od /Ob0 /D WIN32 /D _WINDOWS /D UNICODE /D
_UNICODE /D "CMAKE_INTDIR=\"Debug\"" /D _UNICODE /D UNICODE /Gm- /RTC1 /MTd /GS /fp:precise
/Zc:wchar_t /Zc:forScope /Zc:inline /Fo"cmTC_f5e5c.dir\Debug\" /Fd"cmTC_f5e5c.dir\Debug\vc141.pdb"
/Gd /TC /errorReport:queue D:\DCOS\mesos\CMakeFiles\CMakeTmp\CheckIncludeFile.c

  CheckIncludeFile.c

  

D:\DCOS\mesos\CMakeFiles\CMakeTmp\CheckIncludeFile.c(1): fatal error C1083: Cannot open include
file: 'pthread.h': No such file or directory [D:\DCOS\mesos\CMakeFiles\CMakeTmp\cmTC_f5e5c.vcxproj]

Done Building Project "D:\DCOS\mesos\CMakeFiles\CMakeTmp\cmTC_f5e5c.vcxproj" (default targets)
-- FAILED.



Build FAILED.



"D:\DCOS\mesos\CMakeFiles\CMakeTmp\cmTC_f5e5c.vcxproj" (default target) (1) ->

(ClCompile target) -> 

  D:\DCOS\mesos\CMakeFiles\CMakeTmp\CheckIncludeFile.c(1): fatal error C1083: Cannot open
include file: 'pthread.h': No such file or directory [D:\DCOS\mesos\CMakeFiles\CMakeTmp\cmTC_f5e5c.vcxproj]



    0 Warning(s)

    1 Error(s)



Time Elapsed 00:00:00.58



```

- Mesos Reviewbot Windows


On Jan. 8, 2018, 12:36 p.m., Michael Park wrote:
> 
> -----------------------------------------------------------
> This is an automatically generated e-mail. To reply, visit:
> https://reviews.apache.org/r/65031/
> -----------------------------------------------------------
> 
> (Updated Jan. 8, 2018, 12:36 p.m.)
> 
> 
> Review request for mesos and Benjamin Mahler.
> 
> 
> Bugs: MESOS-8375
>     https://issues.apache.org/jira/browse/MESOS-8375
> 
> 
> Repository: mesos
> 
> 
> Description
> -------
> 
> Replaced `convertResourceFormat` with `downgradeResources` accordingly.
> 
> 
> Diffs
> -----
> 
>   src/master/registry_operations.hpp 41047f0b672ebbfe8d323221f37bf6b617e8b6ea 
>   src/master/registry_operations.cpp 149009b07663f530c444d0b66667205f23fe4510 
> 
> 
> Diff: https://reviews.apache.org/r/65031/diff/2/
> 
> 
> Testing
> -------
> 
> 
> Thanks,
> 
> Michael Park
> 
>


Mime
  • Unnamed multipart/alternative (inline, None, 0 bytes)
View raw message