mesos-reviews mailing list archives

Site index · List index
Message view « Date » · « Thread »
Top « Date » · « Thread »
From Mesos Reviewbot Windows <revi...@mesos.apache.org>
Subject Re: Review Request 64940: Prevented a crash when an agent with terminal tasks is lost.
Date Thu, 11 Jan 2018 19:24:20 GMT

-----------------------------------------------------------
This is an automatically generated e-mail. To reply, visit:
https://reviews.apache.org/r/64940/#review195245
-----------------------------------------------------------



FAIL: Mesos tests failed to build.

Reviews applied: `['64940']`

Failed command: `cmake.exe --build . --target mesos-tests --config Debug`

All the build artifacts available at: http://dcos-win.westus.cloudapp.azure.com/mesos-build/review/64940

Relevant logs:

- [mesos-tests-build-cmake-stdout.log](http://dcos-win.westus.cloudapp.azure.com/mesos-build/review/64940/logs/mesos-tests-build-cmake-stdout.log):

```
  C:\Program Files (x86)\Microsoft Visual Studio\2017\Community\VC\Tools\MSVC\14.12.25827\include\vector(590):
fatal error C1088: Cannot flush compiler intermediate file: 'C:\Users\mesos\AppData\Local\Temp_CL_52516f0cex':
No space left on device (compiling source file D:\DCOS\mesos\mesos\src\tests\fault_tolerance_tests.cpp)
[D:\DCOS\mesos\src\tests\mesos-tests.vcxproj]
  C:\Program Files (x86)\Microsoft Visual Studio\2017\Community\VC\Tools\MSVC\14.12.25827\include\xutility(3118):
fatal error C1088: Cannot flush compiler intermediate file: 'C:\Users\mesos\AppData\Local\Temp_CL_f3419c4eex':
No space left on device (compiling source file D:\DCOS\mesos\mesos\src\tests\default_executor_tests.cpp)
[D:\DCOS\mesos\src\tests\mesos-tests.vcxproj]
  C:\Program Files (x86)\Microsoft Visual Studio\2017\Community\VC\Tools\MSVC\14.12.25827\include\xtree(1792):
fatal error C1088: Cannot flush compiler intermediate file: 'C:\Users\mesos\AppData\Local\Temp_CL_e4799263ex':
No space left on device (compiling source file D:\DCOS\mesos\mesos\src\tests\master_maintenance_tests.cpp)
[D:\DCOS\mesos\src\tests\mesos-tests.vcxproj]
  D:\DCOS\mesos\3rdparty\googletest-1.8.0\src\googletest-1.8.0\googletest\include\gtest/gtest-printers.h(857):
fatal error C1088: Cannot flush compiler intermediate file: 'C:\Users\mesos\AppData\Local\Temp_CL_23766635ex':
No space left on device (compiling source file D:\DCOS\mesos\mesos\src\tests\health_check_tests.cpp)
[D:\DCOS\mesos\src\tests\mesos-tests.vcxproj]
  C:\Program Files (x86)\Microsoft Visual Studio\2017\Community\VC\Tools\MSVC\14.12.25827\include\xutility(492):
fatal error C1088: Cannot flush compiler intermediate file: 'C:\Users\mesos\AppData\Local\Temp_CL_f0a7b581ex':
No space left on device (compiling source file D:\DCOS\mesos\mesos\src\tests\hierarchical_allocator_tests.cpp)
[D:\DCOS\mesos\src\tests\mesos-tests.vcxproj]
  C:\Program Files (x86)\Microsoft Visual Studio\2017\Community\VC\Tools\MSVC\14.12.25827\include\tuple(274):
fatal error C1088: Cannot flush compiler intermediate file: 'C:\Users\mesos\AppData\Local\Temp_CL_b053ea7fsy':
No space left on device (compiling source file D:\DCOS\mesos\mesos\src\tests\hook_tests.cpp)
[D:\DCOS\mesos\src\tests\mesos-tests.vcxproj]
  C:\Program Files (x86)\Microsoft Visual Studio\2017\Community\VC\Tools\MSVC\14.12.25827\include\memory(1587):
fatal error C1088: Cannot flush compiler intermediate file: 'C:\Users\mesos\AppData\Local\Temp_CL_fc0c8d2eex':
No space left on device (compiling source file D:\DCOS\mesos\mesos\src\tests\http_fault_tolerance_tests.cpp)
[D:\DCOS\mesos\src\tests\mesos-tests.vcxproj]
  C:\Program Files (x86)\Microsoft Visual Studio\2017\Community\VC\Tools\MSVC\14.12.25827\include\xtree(1792):
fatal error C1088: Cannot flush compiler intermediate file: 'C:\Users\mesos\AppData\Local\Temp_CL_8f7a8b15ex':
No space left on device (compiling source file D:\DCOS\mesos\mesos\src\tests\http_authentication_tests.cpp)
[D:\DCOS\mesos\src\tests\mesos-tests.vcxproj]
  D:\DCOS\mesos\mesos\3rdparty\libprocess\include\process/gtest.hpp(137): fatal error C1088:
Cannot flush compiler intermediate file: 'C:\Users\mesos\AppData\Local\Temp_CL_0673ed75ex':
No space left on device (compiling source file D:\DCOS\mesos\mesos\src\tests\master_slave_reconciliation_tests.cpp)
[D:\DCOS\mesos\src\tests\mesos-tests.vcxproj]
  C:\Program Files (x86)\Microsoft Visual Studio\2017\Community\VC\Tools\MSVC\14.12.25827\include\xutility(460):
fatal error C1088: Cannot flush compiler intermediate file: 'C:\Users\mesos\AppData\Local\Temp_CL_0de14d03ex':
No space left on device (compiling source file D:\DCOS\mesos\mesos\src\tests\gc_tests.cpp)
[D:\DCOS\mesos\src\tests\mesos-tests.vcxproj]
  D:\DCOS\mesos\3rdparty\protobuf-3.5.0\src\protobuf-3.5.0\src\google/protobuf/generated_message_util.h(288):
fatal error C1088: Cannot flush compiler intermediate file: 'C:\Users\mesos\AppData\Local\Temp_CL_97d6766aex':
No space left on device (compiling source file D:\DCOS\mesos\mesos\src\tests\role_tests.cpp)
[D:\DCOS\mesos\src\tests\mesos-tests.vcxproj]
  C:\Program Files (x86)\Microsoft Visual Studio\2017\Community\VC\Tools\MSVC\14.12.25827\include\xmemory0(943):
fatal error C1088: Cannot flush compiler intermediate file: 'C:\Users\mesos\AppData\Local\Temp_CL_f0b3e955ex':
No space left on device (compiling source file D:\DCOS\mesos\mesos\src\tests\rate_limiting_tests.cpp)
[D:\DCOS\mesos\src\tests\mesos-tests.vcxproj]
  C:\Program Files (x86)\Microsoft Visual Studio\2017\Community\VC\Tools\MSVC\14.12.25827\include\utility(77):
fatal error C1088: Cannot flush compiler intermediate file: 'C:\Users\mesos\AppData\Local\Temp_CL_5fe133bcex':
No space left on device (compiling source file D:\DCOS\mesos\mesos\src\tests\resources_tests.cpp)
[D:\DCOS\mesos\src\tests\mesos-tests.vcxproj]
  C:\Program Files (x86)\Microsoft Visual Studio\2017\Community\VC\Tools\MSVC\14.12.25827\include\tuple(274):
fatal error C1088: Cannot flush compiler intermediate file: 'C:\Users\mesos\AppData\Local\Temp_CL_c4ae0352ex':
No space left on device (compiling source file D:\DCOS\mesos\mesos\src\tests\resource_provider_manager_tests.cpp)
[D:\DCOS\mesos\src\tests\mesos-tests.vcxproj]
  D:\DCOS\mesos\mesos\3rdparty\libprocess\include\process/gmock.hpp(142): fatal error C1088:
Cannot flush compiler intermediate file: 'C:\Users\mesos\AppData\Local\Temp_CL_509c3e82ex':
No space left on device (compiling source file D:\DCOS\mesos\mesos\src\tests\partition_tests.cpp)
[D:\DCOS\mesos\src\tests\mesos-tests.vcxproj]
  D:\DCOS\mesos\3rdparty\protobuf-3.5.0\src\protobuf-3.5.0\src\google/protobuf/arena.h(365):
fatal error C1088: Cannot flush compiler intermediate file: 'C:\Users\mesos\AppData\Local\Temp_CL_c94d7ebeex':
No space left on device (compiling source file D:\DCOS\mesos\mesos\src\tests\paths_tests.cpp)
[D:\DCOS\mesos\src\tests\mesos-tests.vcxproj]
  C:\Program Files (x86)\Microsoft Visual Studio\2017\Community\VC\Tools\MSVC\14.12.25827\include\tuple(159):
fatal error C1088: Cannot flush compiler intermediate file: 'C:\Users\mesos\AppData\Local\Temp_CL_627dd6b5sy':
No space left on device (compiling source file D:\DCOS\mesos\mesos\src\tests\slave_compatibility_tests.cpp)
[D:\DCOS\mesos\src\tests\mesos-tests.vcxproj]
  D:\DCOS\mesos\3rdparty\googletest-1.8.0\src\googletest-1.8.0\googlemock\include\gmock/gmock-matchers.h(782):
fatal error C1088: Cannot flush compiler intermediate file: 'C:\Users\mesos\AppData\Local\Temp_CL_05cd4ea3sy':
No space left on device (compiling source file D:\DCOS\mesos\mesos\src\tests\scheduler_driver_tests.cpp)
[D:\DCOS\mesos\src\tests\mesos-tests.vcxproj]
  C:\Program Files (x86)\Microsoft Visual Studio\2017\Community\VC\Tools\MSVC\14.12.25827\include\tuple(274):
fatal error C1088: Cannot flush compiler intermediate file: 'C:\Users\mesos\AppData\Local\Temp_CL_b2463553sy':
No space left on device (compiling source file D:\DCOS\mesos\mesos\src\tests\scheduler_http_api_tests.cpp)
[D:\DCOS\mesos\src\tests\mesos-tests.vcxproj]
  C:\Program Files (x86)\Microsoft Visual Studio\2017\Community\VC\Tools\MSVC\14.12.25827\include\utility(203):
fatal error C1088: Cannot flush compiler intermediate file: 'C:\Users\mesos\AppData\Local\Temp_CL_64c9f478ex':
No space left on device (compiling source file D:\DCOS\mesos\mesos\src\tests\slave_tests.cpp)
[D:\DCOS\mesos\src\tests\mesos-tests.vcxproj]
  C:\Program Files (x86)\Microsoft Visual Studio\2017\Community\VC\Tools\MSVC\14.12.25827\include\functional(1093):
fatal error C1088: Cannot flush compiler intermediate file: 'C:\Users\mesos\AppData\Local\Temp_CL_d6bdaa2csy':
No space left on device (compiling source file D:\DCOS\mesos\mesos\src\tests\scheduler_event_call_tests.cpp)
[D:\DCOS\mesos\src\tests\mesos-tests.vcxproj]
  D:\DCOS\mesos\mesos\3rdparty\libprocess\include\process/dispatch.hpp(183): fatal error C1088:
Cannot flush compiler intermediate file: 'C:\Users\mesos\AppData\Local\Temp_CL_0c32ca3cex':
No space left on device (compiling source file D:\DCOS\mesos\mesos\src\tests\scheduler_tests.cpp)
[D:\DCOS\mesos\src\tests\mesos-tests.vcxproj]
  C:\Program Files (x86)\Microsoft Visual Studio\2017\Community\VC\Tools\MSVC\14.12.25827\include\type_traits(16707566):
fatal error C1088: Cannot flush compiler intermediate file: 'C:\Users\mesos\AppData\Local\Temp_CL_c758ad27sy':
No space left on device (compiling source file D:\DCOS\mesos\mesos\src\tests\slave_authorization_tests.cpp)
[D:\DCOS\mesos\src\tests\mesos-tests.vcxproj]
  D:\DCOS\mesos\src\master/registry.pb.h(1139): fatal error C1088: Cannot flush compiler intermediate
file: 'C:\Users\mesos\AppData\Local\Temp_CL_6f973714ex': No space left on device (compiling
source file D:\DCOS\mesos\mesos\src\tests\slave_validation_tests.cpp) [D:\DCOS\mesos\src\tests\mesos-tests.vcxproj]

    222 Warning(s)
    36 Error(s)

Time Elapsed 00:21:22.86
```

- [mesos-tests-CMakeOutput.log](http://dcos-win.westus.cloudapp.azure.com/mesos-build/review/64940/logs/mesos-tests-CMakeOutput.log):

```
  Creating directory "cmTC_eb653.dir\Debug\".

  Creating directory "D:\DCOS\mesos\CMakeFiles\CMakeTmp\Debug\".

  Creating directory "cmTC_eb653.dir\Debug\cmTC_eb653.tlog\".

InitializeBuildStatus:

  Creating "cmTC_eb653.dir\Debug\cmTC_eb653.tlog\unsuccessfulbuild" because "AlwaysCreate"
was specified.

ClCompile:

  C:\Program Files (x86)\Microsoft Visual Studio\2017\Community\VC\Tools\MSVC\14.12.25827\bin\HostX64\x64\CL.exe
/c /Zi /W3 /WX- /diagnostics:classic /Od /Ob0 /D WIN32 /D _WINDOWS /D COMPILER_SUPPORTS_CXX11
/D "CMAKE_INTDIR=\"Debug\"" /D _MBCS /Gm- /EHsc /RTC1 /MDd /GS /fp:precise /Zc:wchar_t /Zc:forScope
/Zc:inline /GR /Fo"cmTC_eb653.dir\Debug\" /Fd"cmTC_eb653.dir\Debug\vc141.pdb" /Gd /TP /errorReport:queue
D:\DCOS\mesos\CMakeFiles\CMakeTmp\src.cxx

  Microsoft (R) C/C++ Optimizing Compiler Version 19.12.25830.2 for x64

  Copyright (C) Microsoft Corporation.  All rights reserved.

  

  cl /c /Zi /W3 /WX- /diagnostics:classic /Od /Ob0 /D WIN32 /D _WINDOWS /D COMPILER_SUPPORTS_CXX11
/D "CMAKE_INTDIR=\"Debug\"" /D _MBCS /Gm- /EHsc /RTC1 /MDd /GS /fp:precise /Zc:wchar_t /Zc:forScope
/Zc:inline /GR /Fo"cmTC_eb653.dir\Debug\" /Fd"cmTC_eb653.dir\Debug\vc141.pdb" /Gd /TP /errorReport:queue
D:\DCOS\mesos\CMakeFiles\CMakeTmp\src.cxx

  src.cxx

  

Link:

  C:\Program Files (x86)\Microsoft Visual Studio\2017\Community\VC\Tools\MSVC\14.12.25827\bin\HostX64\x64\link.exe
/ERRORREPORT:QUEUE /OUT:"D:\DCOS\mesos\CMakeFiles\CMakeTmp\Debug\cmTC_eb653.exe" /INCREMENTAL
/NOLOGO kernel32.lib user32.lib gdi32.lib winspool.lib shell32.lib ole32.lib oleaut32.lib
uuid.lib comdlg32.lib advapi32.lib /MANIFEST /MANIFESTUAC:"level='asInvoker' uiAccess='false'"
/manifest:embed /DEBUG /PDB:"D:/DCOS/mesos/CMakeFiles/CMakeTmp/Debug/cmTC_eb653.pdb" /SUBSYSTEM:CONSOLE
/TLBID:1 /DYNAMICBASE /NXCOMPAT /IMPLIB:"D:/DCOS/mesos/CMakeFiles/CMakeTmp/Debug/cmTC_eb653.lib"
/MACHINE:X64  /machine:x64 cmTC_eb653.dir\Debug\src.obj

  cmTC_eb653.vcxproj -> D:\DCOS\mesos\CMakeFiles\CMakeTmp\Debug\cmTC_eb653.exe

FinalizeBuildStatus:

  Deleting file "cmTC_eb653.dir\Debug\cmTC_eb653.tlog\unsuccessfulbuild".

  Touching "cmTC_eb653.dir\Debug\cmTC_eb653.tlog\cmTC_eb653.lastbuildstate".

Done Building Project "D:\DCOS\mesos\CMakeFiles\CMakeTmp\cmTC_eb653.vcxproj" (default targets).



Build succeeded.

    0 Warning(s)

    0 Error(s)



Time Elapsed 00:00:01.19


Source file was:
int main() { return 0; }
```

- [mesos-tests-CMakeError.log](http://dcos-win.westus.cloudapp.azure.com/mesos-build/review/64940/logs/mesos-tests-CMakeError.log):

```
PrepareForBuild:

  Creating directory "cmTC_43b3f.dir\Debug\".

  Creating directory "D:\DCOS\mesos\CMakeFiles\CMakeTmp\Debug\".

  Creating directory "cmTC_43b3f.dir\Debug\cmTC_43b3f.tlog\".

InitializeBuildStatus:

  Creating "cmTC_43b3f.dir\Debug\cmTC_43b3f.tlog\unsuccessfulbuild" because "AlwaysCreate"
was specified.

ClCompile:

  C:\Program Files (x86)\Microsoft Visual Studio\2017\Community\VC\Tools\MSVC\14.12.25827\bin\HostX64\x64\CL.exe
/c /Zi /W3 /WX- /diagnostics:classic /MP /Od /Ob0 /D WIN32 /D _WINDOWS /D UNICODE /D _UNICODE
/D "CMAKE_INTDIR=\"Debug\"" /D _UNICODE /D UNICODE /Gm- /RTC1 /MTd /GS /fp:precise /Zc:wchar_t
/Zc:forScope /Zc:inline /Fo"cmTC_43b3f.dir\Debug\" /Fd"cmTC_43b3f.dir\Debug\vc141.pdb" /Gd
/TC /errorReport:queue D:\DCOS\mesos\CMakeFiles\CMakeTmp\CheckIncludeFile.c

  Microsoft (R) C/C++ Optimizing Compiler Version 19.12.25830.2 for x64

  Copyright (C) Microsoft Corporation.  All rights reserved.

  

  cl /c /Zi /W3 /WX- /diagnostics:classic /MP /Od /Ob0 /D WIN32 /D _WINDOWS /D UNICODE /D
_UNICODE /D "CMAKE_INTDIR=\"Debug\"" /D _UNICODE /D UNICODE /Gm- /RTC1 /MTd /GS /fp:precise
/Zc:wchar_t /Zc:forScope /Zc:inline /Fo"cmTC_43b3f.dir\Debug\" /Fd"cmTC_43b3f.dir\Debug\vc141.pdb"
/Gd /TC /errorReport:queue D:\DCOS\mesos\CMakeFiles\CMakeTmp\CheckIncludeFile.c

  CheckIncludeFile.c

  

D:\DCOS\mesos\CMakeFiles\CMakeTmp\CheckIncludeFile.c(1): fatal error C1083: Cannot open include
file: 'pthread.h': No such file or directory [D:\DCOS\mesos\CMakeFiles\CMakeTmp\cmTC_43b3f.vcxproj]

Done Building Project "D:\DCOS\mesos\CMakeFiles\CMakeTmp\cmTC_43b3f.vcxproj" (default targets)
-- FAILED.



Build FAILED.



"D:\DCOS\mesos\CMakeFiles\CMakeTmp\cmTC_43b3f.vcxproj" (default target) (1) ->

(ClCompile target) -> 

  D:\DCOS\mesos\CMakeFiles\CMakeTmp\CheckIncludeFile.c(1): fatal error C1083: Cannot open
include file: 'pthread.h': No such file or directory [D:\DCOS\mesos\CMakeFiles\CMakeTmp\cmTC_43b3f.vcxproj]



    0 Warning(s)

    1 Error(s)



Time Elapsed 00:00:00.59



```

- Mesos Reviewbot Windows


On Jan. 5, 2018, 11:37 a.m., James Peach wrote:
> 
> -----------------------------------------------------------
> This is an automatically generated e-mail. To reply, visit:
> https://reviews.apache.org/r/64940/
> -----------------------------------------------------------
> 
> (Updated Jan. 5, 2018, 11:37 a.m.)
> 
> 
> Review request for mesos, Benjamin Mahler, Gaston Kleiman, Jie Yu, Vinod Kone, and Jiang
Yan Xu.
> 
> 
> Bugs: MESOS-8337
>     https://issues.apache.org/jira/browse/MESOS-8337
> 
> 
> Repository: mesos
> 
> 
> Description
> -------
> 
> If an agent is lost, we try to remove all the tasks that might have
> been lost. If a task is already terminal but has unacknowleged status
> updates, it is expected that we track it in the unreachable tasks list
> so we should remove the CHECK that prevents this. This also backs out
> changes to how unreachable tasks are presented in the HTTP endpoints to
> restore compatibility with previous Mesos releases.
> 
> 
> Diffs
> -----
> 
>   src/master/http.cpp bc29fafb1f4b515aec3b77850f960c88a65c8362 
>   src/master/master.hpp 5e6ba53c075174a1e514a395ceb17c26201ec470 
>   src/master/master.cpp 6fc5de89e54ba0b9ae2c4fb475be9878910820d3 
>   src/tests/mesos.hpp 93913f2e01898c73e09de58a975aa467e714d882 
>   src/tests/partition_tests.cpp 3813139f576ea01db0197f0fe8a73597db1bb69a 
> 
> 
> Diff: https://reviews.apache.org/r/64940/diff/6/
> 
> 
> Testing
> -------
> 
> make check (Fedora 27)
> 
> 
> Thanks,
> 
> James Peach
> 
>


Mime
  • Unnamed multipart/alternative (inline, None, 0 bytes)
View raw message