mesos-reviews mailing list archives

Site index · List index
Message view « Date » · « Thread »
Top « Date » · « Thread »
From Mesos Reviewbot Windows <revi...@mesos.apache.org>
Subject Re: Review Request 64931: Added a TODO for informing frameworks that an agent is unreachable.
Date Wed, 10 Jan 2018 18:32:07 GMT

-----------------------------------------------------------
This is an automatically generated e-mail. To reply, visit:
https://reviews.apache.org/r/64931/#review195160
-----------------------------------------------------------



FAIL: mesos-java failed to build.

Reviews applied: `['64930', '64931']`

Failed command: `cmake.exe --build . --target mesos-java`

All the build artifacts available at: http://dcos-win.westus.cloudapp.azure.com/mesos-build/review/64931

Relevant logs:

- [mesos-java-build-cmake-stdout.log](http://dcos-win.westus.cloudapp.azure.com/mesos-build/review/64931/logs/mesos-java-build-cmake-stdout.log):

```
  D:\DCOS\mesos\3rdparty\protobuf-3.5.0\src\protobuf-3.5.0\src\google/protobuf/io/coded_stream.h(1182):
fatal error C1088: Cannot flush compiler intermediate file: 'C:\Users\mesos\AppData\Local\Temp_CL_a1b1d689ex':
No space left on device (compiling source file D:\DCOS\mesos\3rdparty\protobuf-3.5.0\src\protobuf-3.5.0\src\google\protobuf\generated_message_table_driven_lite.cc)
[D:\DCOS\mesos\3rdparty\protobuf-3.5.0\src\protobuf-3.5.0-build\libprotobuf-lite.vcxproj]
[D:\DCOS\mesos\3rdparty\protobuf-3.5.0.vcxproj]
  D:\DCOS\mesos\3rdparty\protobuf-3.5.0\src\protobuf-3.5.0\src\google\protobuf\io\zero_copy_stream_impl_lite.cc(298):
fatal error C1088: Cannot flush compiler intermediate file: 'C:\Users\mesos\AppData\Local\Temp_CL_2c50cdf0ex':
No space left on device [D:\DCOS\mesos\3rdparty\protobuf-3.5.0\src\protobuf-3.5.0-build\libprotobuf-lite.vcxproj]
[D:\DCOS\mesos\3rdparty\protobuf-3.5.0.vcxproj]
  C:\Program Files (x86)\Windows Kits\10\Include\10.0.16299.0\ucrt\stdio.h(1726): fatal error
C1088: Cannot flush compiler intermediate file: 'C:\Users\mesos\AppData\Local\Temp_CL_39c4c1f2ex':
No space left on device (compiling source file D:\DCOS\mesos\3rdparty\protobuf-3.5.0\src\protobuf-3.5.0\src\google\protobuf\stubs\bytestream.cc)
[D:\DCOS\mesos\3rdparty\protobuf-3.5.0\src\protobuf-3.5.0-build\libprotobuf-lite.vcxproj]
[D:\DCOS\mesos\3rdparty\protobuf-3.5.0.vcxproj]
  C:\Program Files (x86)\Microsoft Visual Studio\2017\Community\VC\Tools\MSVC\14.12.25827\include\limits(389):
fatal error C1088: Cannot flush compiler intermediate file: 'C:\Users\mesos\AppData\Local\Temp_CL_2bb5647fex':
No space left on device (compiling source file D:\DCOS\mesos\3rdparty\protobuf-3.5.0\src\protobuf-3.5.0\src\google\protobuf\stubs\int128.cc)
[D:\DCOS\mesos\3rdparty\protobuf-3.5.0\src\protobuf-3.5.0-build\libprotobuf-lite.vcxproj]
[D:\DCOS\mesos\3rdparty\protobuf-3.5.0.vcxproj]
  C:\Program Files (x86)\Microsoft Visual Studio\2017\Community\VC\Tools\MSVC\14.12.25827\include\limits(389):
fatal error C1088: Cannot flush compiler intermediate file: 'C:\Users\mesos\AppData\Local\Temp_CL_09dbf307ex':
No space left on device (compiling source file D:\DCOS\mesos\3rdparty\protobuf-3.5.0\src\protobuf-3.5.0\src\google\protobuf\stubs\once.cc)
[D:\DCOS\mesos\3rdparty\protobuf-3.5.0\src\protobuf-3.5.0-build\libprotobuf-lite.vcxproj]
[D:\DCOS\mesos\3rdparty\protobuf-3.5.0.vcxproj]
  D:\DCOS\mesos\3rdparty\protobuf-3.5.0\src\protobuf-3.5.0\src\google\protobuf\io\zero_copy_stream.cc(56):
fatal error C1088: Cannot flush compiler intermediate file: 'C:\Users\mesos\AppData\Local\Temp_CL_e928331egl':
No space left on device [D:\DCOS\mesos\3rdparty\protobuf-3.5.0\src\protobuf-3.5.0-build\libprotobuf-lite.vcxproj]
[D:\DCOS\mesos\3rdparty\protobuf-3.5.0.vcxproj]
  C:\Program Files (x86)\Microsoft Visual Studio\2017\Community\VC\Tools\MSVC\14.12.25827\include\xutility(276):
fatal error C1088: Cannot flush compiler intermediate file: 'C:\Users\mesos\AppData\Local\Temp_CL_82fe7163ex':
No space left on device (compiling source file D:\DCOS\mesos\3rdparty\protobuf-3.5.0\src\protobuf-3.5.0\src\google\protobuf\stubs\common.cc)
[D:\DCOS\mesos\3rdparty\protobuf-3.5.0\src\protobuf-3.5.0-build\libprotobuf-lite.vcxproj]
[D:\DCOS\mesos\3rdparty\protobuf-3.5.0.vcxproj]
  D:\DCOS\mesos\3rdparty\protobuf-3.5.0\src\protobuf-3.5.0\src\google\protobuf\arenastring.cc(44):
fatal error C1088: Cannot flush compiler intermediate file: 'C:\Users\mesos\AppData\Local\Temp_CL_028490d2gl':
No space left on device [D:\DCOS\mesos\3rdparty\protobuf-3.5.0\src\protobuf-3.5.0-build\libprotobuf-lite.vcxproj]
[D:\DCOS\mesos\3rdparty\protobuf-3.5.0.vcxproj]
  C:\Program Files (x86)\Microsoft Visual Studio\2017\Community\VC\Tools\MSVC\14.12.25827\include\xlocale(1578):
fatal error C1088: Cannot flush compiler intermediate file: 'C:\Users\mesos\AppData\Local\Temp_CL_258ab5a7ex':
No space left on device (compiling source file D:\DCOS\mesos\3rdparty\protobuf-3.5.0\src\protobuf-3.5.0\src\google\protobuf\stubs\stringprintf.cc)
[D:\DCOS\mesos\3rdparty\protobuf-3.5.0\src\protobuf-3.5.0-build\libprotobuf-lite.vcxproj]
[D:\DCOS\mesos\3rdparty\protobuf-3.5.0.vcxproj]
  D:\DCOS\mesos\3rdparty\protobuf-3.5.0\src\protobuf-3.5.0\src\google\protobuf\stubs\atomicops_internals_x86_gcc.cc(138):
fatal error C1088: Cannot flush compiler intermediate file: 'C:\Users\mesos\AppData\Local\Temp_CL_0ce96c4bex':
No space left on device [D:\DCOS\mesos\3rdparty\protobuf-3.5.0\src\protobuf-3.5.0-build\libprotobuf-lite.vcxproj]
[D:\DCOS\mesos\3rdparty\protobuf-3.5.0.vcxproj]
  C:\Program Files (x86)\Microsoft Visual Studio\2017\Community\VC\Tools\MSVC\14.12.25827\include\xlocale(1578):
fatal error C1088: Cannot flush compiler intermediate file: 'C:\Users\mesos\AppData\Local\Temp_CL_e04126fbex':
No space left on device (compiling source file D:\DCOS\mesos\3rdparty\protobuf-3.5.0\src\protobuf-3.5.0\src\google\protobuf\stubs\status.cc)
[D:\DCOS\mesos\3rdparty\protobuf-3.5.0\src\protobuf-3.5.0-build\libprotobuf-lite.vcxproj]
[D:\DCOS\mesos\3rdparty\protobuf-3.5.0.vcxproj]
  C:\Program Files (x86)\Microsoft Visual Studio\2017\Community\VC\Tools\MSVC\14.12.25827\include\xlocale(2362):
fatal error C1088: Cannot flush compiler intermediate file: 'C:\Users\mesos\AppData\Local\Temp_CL_b22a670dsy':
No space left on device (compiling source file D:\DCOS\mesos\3rdparty\protobuf-3.5.0\src\protobuf-3.5.0\src\google\protobuf\stubs\statusor.cc)
[D:\DCOS\mesos\3rdparty\protobuf-3.5.0\src\protobuf-3.5.0-build\libprotobuf-lite.vcxproj]
[D:\DCOS\mesos\3rdparty\protobuf-3.5.0.vcxproj]
  C:\Program Files (x86)\Microsoft Visual Studio\2017\Community\VC\Tools\MSVC\14.12.25827\include\xutility(276):
fatal error C1088: Cannot flush compiler intermediate file: 'C:\Users\mesos\AppData\Local\Temp_CL_6c918dceex':
No space left on device (compiling source file D:\DCOS\mesos\3rdparty\protobuf-3.5.0\src\protobuf-3.5.0\src\google\protobuf\wire_format_lite.cc)
[D:\DCOS\mesos\3rdparty\protobuf-3.5.0\src\protobuf-3.5.0-build\libprotobuf-lite.vcxproj]
[D:\DCOS\mesos\3rdparty\protobuf-3.5.0.vcxproj]
  C:\Program Files (x86)\Microsoft Visual Studio\2017\Community\VC\Tools\MSVC\14.12.25827\include\exception(396):
fatal error C1088: Cannot flush compiler intermediate file: 'C:\Users\mesos\AppData\Local\Temp_CL_abbb4b06ex':
No space left on device (compiling source file D:\DCOS\mesos\3rdparty\protobuf-3.5.0\src\protobuf-3.5.0\src\google\protobuf\stubs\io_win32.cc)
[D:\DCOS\mesos\3rdparty\protobuf-3.5.0\src\protobuf-3.5.0-build\libprotobuf-lite.vcxproj]
[D:\DCOS\mesos\3rdparty\protobuf-3.5.0.vcxproj]
  C:\Program Files (x86)\Microsoft Visual Studio\2017\Community\VC\Tools\MSVC\14.12.25827\include\xlocale(1565):
fatal error C1088: Cannot flush compiler intermediate file: 'C:\Users\mesos\AppData\Local\Temp_CL_34a47edaex':
No space left on device (compiling source file D:\DCOS\mesos\3rdparty\protobuf-3.5.0\src\protobuf-3.5.0\src\google\protobuf\stubs\time.cc)
[D:\DCOS\mesos\3rdparty\protobuf-3.5.0\src\protobuf-3.5.0-build\libprotobuf-lite.vcxproj]
[D:\DCOS\mesos\3rdparty\protobuf-3.5.0.vcxproj]
  C:\Program Files (x86)\Microsoft Visual Studio\2017\Community\VC\Tools\MSVC\14.12.25827\include\xlocale(1565):
fatal error C1088: Cannot flush compiler intermediate file: 'C:\Users\mesos\AppData\Local\Temp_CL_b0642738ex':
No space left on device (compiling source file D:\DCOS\mesos\3rdparty\protobuf-3.5.0\src\protobuf-3.5.0\src\google\protobuf\stubs\strutil.cc)
[D:\DCOS\mesos\3rdparty\protobuf-3.5.0\src\protobuf-3.5.0-build\libprotobuf-lite.vcxproj]
[D:\DCOS\mesos\3rdparty\protobuf-3.5.0.vcxproj]
  C:\Program Files (x86)\Microsoft Visual Studio\2017\Community\VC\Tools\MSVC\14.12.25827\include\ios(80):
fatal error C1088: Cannot flush compiler intermediate file: 'C:\Users\mesos\AppData\Local\Temp_CL_06dc3bd9ex':
No space left on device (compiling source file D:\DCOS\mesos\3rdparty\protobuf-3.5.0\src\protobuf-3.5.0\src\google\protobuf\stubs\stringpiece.cc)
[D:\DCOS\mesos\3rdparty\protobuf-3.5.0\src\protobuf-3.5.0-build\libprotobuf-lite.vcxproj]
[D:\DCOS\mesos\3rdparty\protobuf-3.5.0.vcxproj]
  C:\Program Files (x86)\Microsoft Visual Studio\2017\Community\VC\Tools\MSVC\14.12.25827\include\string(517):
fatal error C1088: Cannot flush compiler intermediate file: 'C:\Users\mesos\AppData\Local\Temp_CL_ddd5cc84ex':
No space left on device (compiling source file D:\DCOS\mesos\3rdparty\protobuf-3.5.0\src\protobuf-3.5.0\src\google\protobuf\stubs\structurally_valid.cc)
[D:\DCOS\mesos\3rdparty\protobuf-3.5.0\src\protobuf-3.5.0-build\libprotobuf-lite.vcxproj]
[D:\DCOS\mesos\3rdparty\protobuf-3.5.0.vcxproj]


"D:\DCOS\mesos\src\java\mesos-java.vcxproj" (default target) (1) ->
"D:\DCOS\mesos\3rdparty\zookeeper-3.4.8.vcxproj" (default target) (21) ->
  LINK : fatal error LNK1104: cannot open file 'C:\Users\mesos\AppData\Local\Temp\lnk{5FF70E0C-CC29-42CE-BAC9-19B9FBF05101}.tmp'
[D:\DCOS\mesos\3rdparty\zookeeper-3.4.8\src\zookeeper-3.4.8-build\cli.vcxproj] [D:\DCOS\mesos\3rdparty\zookeeper-3.4.8.vcxproj]
  LINK : fatal error LNK1104: cannot open file 'C:\Users\mesos\AppData\Local\Temp\lnk{5FF70E0C-CC29-42CE-BAC9-19B9FBF05101}.tmp'
[D:\DCOS\mesos\3rdparty\zookeeper-3.4.8\src\zookeeper-3.4.8-build\cli.vcxproj] [D:\DCOS\mesos\3rdparty\zookeeper-3.4.8.vcxproj]

    193 Warning(s)
    210 Error(s)

Time Elapsed 00:10:55.71
```

- [mesos-java-build-CMakeOutput.log](http://dcos-win.westus.cloudapp.azure.com/mesos-build/review/64931/logs/mesos-java-build-CMakeOutput.log):

```
  Creating directory "cmTC_9af03.dir\Debug\".

  Creating directory "D:\DCOS\mesos\CMakeFiles\CMakeTmp\Debug\".

  Creating directory "cmTC_9af03.dir\Debug\cmTC_9af03.tlog\".

InitializeBuildStatus:

  Creating "cmTC_9af03.dir\Debug\cmTC_9af03.tlog\unsuccessfulbuild" because "AlwaysCreate"
was specified.

ClCompile:

  C:\Program Files (x86)\Microsoft Visual Studio\2017\Community\VC\Tools\MSVC\14.12.25827\bin\HostX64\x64\CL.exe
/c /Zi /W3 /WX- /diagnostics:classic /Od /Ob0 /D WIN32 /D _WINDOWS /D COMPILER_SUPPORTS_CXX11
/D "CMAKE_INTDIR=\"Debug\"" /D _MBCS /Gm- /EHsc /RTC1 /MDd /GS /fp:precise /Zc:wchar_t /Zc:forScope
/Zc:inline /GR /Fo"cmTC_9af03.dir\Debug\" /Fd"cmTC_9af03.dir\Debug\vc141.pdb" /Gd /TP /errorReport:queue
D:\DCOS\mesos\CMakeFiles\CMakeTmp\src.cxx

  Microsoft (R) C/C++ Optimizing Compiler Version 19.12.25830.2 for x64

  Copyright (C) Microsoft Corporation.  All rights reserved.

  

  cl /c /Zi /W3 /WX- /diagnostics:classic /Od /Ob0 /D WIN32 /D _WINDOWS /D COMPILER_SUPPORTS_CXX11
/D "CMAKE_INTDIR=\"Debug\"" /D _MBCS /Gm- /EHsc /RTC1 /MDd /GS /fp:precise /Zc:wchar_t /Zc:forScope
/Zc:inline /GR /Fo"cmTC_9af03.dir\Debug\" /Fd"cmTC_9af03.dir\Debug\vc141.pdb" /Gd /TP /errorReport:queue
D:\DCOS\mesos\CMakeFiles\CMakeTmp\src.cxx

  src.cxx

  

Link:

  C:\Program Files (x86)\Microsoft Visual Studio\2017\Community\VC\Tools\MSVC\14.12.25827\bin\HostX64\x64\link.exe
/ERRORREPORT:QUEUE /OUT:"D:\DCOS\mesos\CMakeFiles\CMakeTmp\Debug\cmTC_9af03.exe" /INCREMENTAL
/NOLOGO kernel32.lib user32.lib gdi32.lib winspool.lib shell32.lib ole32.lib oleaut32.lib
uuid.lib comdlg32.lib advapi32.lib /MANIFEST /MANIFESTUAC:"level='asInvoker' uiAccess='false'"
/manifest:embed /DEBUG /PDB:"D:/DCOS/mesos/CMakeFiles/CMakeTmp/Debug/cmTC_9af03.pdb" /SUBSYSTEM:CONSOLE
/TLBID:1 /DYNAMICBASE /NXCOMPAT /IMPLIB:"D:/DCOS/mesos/CMakeFiles/CMakeTmp/Debug/cmTC_9af03.lib"
/MACHINE:X64  /machine:x64 cmTC_9af03.dir\Debug\src.obj

  cmTC_9af03.vcxproj -> D:\DCOS\mesos\CMakeFiles\CMakeTmp\Debug\cmTC_9af03.exe

FinalizeBuildStatus:

  Deleting file "cmTC_9af03.dir\Debug\cmTC_9af03.tlog\unsuccessfulbuild".

  Touching "cmTC_9af03.dir\Debug\cmTC_9af03.tlog\cmTC_9af03.lastbuildstate".

Done Building Project "D:\DCOS\mesos\CMakeFiles\CMakeTmp\cmTC_9af03.vcxproj" (default targets).



Build succeeded.

    0 Warning(s)

    0 Error(s)



Time Elapsed 00:00:01.19


Source file was:
int main() { return 0; }
```

- [mesos-java-build-CMakeError.log](http://dcos-win.westus.cloudapp.azure.com/mesos-build/review/64931/logs/mesos-java-build-CMakeError.log):

```
PrepareForBuild:

  Creating directory "cmTC_c797b.dir\Debug\".

  Creating directory "D:\DCOS\mesos\CMakeFiles\CMakeTmp\Debug\".

  Creating directory "cmTC_c797b.dir\Debug\cmTC_c797b.tlog\".

InitializeBuildStatus:

  Creating "cmTC_c797b.dir\Debug\cmTC_c797b.tlog\unsuccessfulbuild" because "AlwaysCreate"
was specified.

ClCompile:

  C:\Program Files (x86)\Microsoft Visual Studio\2017\Community\VC\Tools\MSVC\14.12.25827\bin\HostX64\x64\CL.exe
/c /Zi /W3 /WX- /diagnostics:classic /MP /Od /Ob0 /D WIN32 /D _WINDOWS /D UNICODE /D _UNICODE
/D "CMAKE_INTDIR=\"Debug\"" /D _UNICODE /D UNICODE /Gm- /RTC1 /MTd /GS /fp:precise /Zc:wchar_t
/Zc:forScope /Zc:inline /Fo"cmTC_c797b.dir\Debug\" /Fd"cmTC_c797b.dir\Debug\vc141.pdb" /Gd
/TC /errorReport:queue D:\DCOS\mesos\CMakeFiles\CMakeTmp\CheckIncludeFile.c

  Microsoft (R) C/C++ Optimizing Compiler Version 19.12.25830.2 for x64

  Copyright (C) Microsoft Corporation.  All rights reserved.

  

  cl /c /Zi /W3 /WX- /diagnostics:classic /MP /Od /Ob0 /D WIN32 /D _WINDOWS /D UNICODE /D
_UNICODE /D "CMAKE_INTDIR=\"Debug\"" /D _UNICODE /D UNICODE /Gm- /RTC1 /MTd /GS /fp:precise
/Zc:wchar_t /Zc:forScope /Zc:inline /Fo"cmTC_c797b.dir\Debug\" /Fd"cmTC_c797b.dir\Debug\vc141.pdb"
/Gd /TC /errorReport:queue D:\DCOS\mesos\CMakeFiles\CMakeTmp\CheckIncludeFile.c

  CheckIncludeFile.c

  

D:\DCOS\mesos\CMakeFiles\CMakeTmp\CheckIncludeFile.c(1): fatal error C1083: Cannot open include
file: 'pthread.h': No such file or directory [D:\DCOS\mesos\CMakeFiles\CMakeTmp\cmTC_c797b.vcxproj]

Done Building Project "D:\DCOS\mesos\CMakeFiles\CMakeTmp\cmTC_c797b.vcxproj" (default targets)
-- FAILED.



Build FAILED.



"D:\DCOS\mesos\CMakeFiles\CMakeTmp\cmTC_c797b.vcxproj" (default target) (1) ->

(ClCompile target) -> 

  D:\DCOS\mesos\CMakeFiles\CMakeTmp\CheckIncludeFile.c(1): fatal error C1083: Cannot open
include file: 'pthread.h': No such file or directory [D:\DCOS\mesos\CMakeFiles\CMakeTmp\cmTC_c797b.vcxproj]



    0 Warning(s)

    1 Error(s)



Time Elapsed 00:00:00.60



```

- Mesos Reviewbot Windows


On Jan. 3, 2018, 10:48 p.m., Benjamin Mahler wrote:
> 
> -----------------------------------------------------------
> This is an automatically generated e-mail. To reply, visit:
> https://reviews.apache.org/r/64931/
> -----------------------------------------------------------
> 
> (Updated Jan. 3, 2018, 10:48 p.m.)
> 
> 
> Review request for mesos, Benno Evers and Vinod Kone.
> 
> 
> Repository: mesos
> 
> 
> Description
> -------
> 
> Currently, we tell partition aware frameworks that unreachable agents
> are LOST. Ideally the partition awareness change would have included
> agent unreachability information rather than only task unreachability
> information.
> 
> 
> Diffs
> -----
> 
>   src/master/master.cpp 03eb178fa1af7d55ae387e6cb42cdc8d721a2196 
> 
> 
> Diff: https://reviews.apache.org/r/64931/diff/1/
> 
> 
> Testing
> -------
> 
> make check
> 
> 
> Thanks,
> 
> Benjamin Mahler
> 
>


Mime
  • Unnamed multipart/alternative (inline, None, 0 bytes)
View raw message