mesos-reviews mailing list archives

Site index · List index
Message view « Date » · « Thread »
Top « Date » · « Thread »
From Mesos Reviewbot Windows <revi...@mesos.apache.org>
Subject Re: Review Request 65073: Fixed post-reviews for posting reviews from `master` branch.
Date Wed, 10 Jan 2018 17:49:52 GMT

-----------------------------------------------------------
This is an automatically generated e-mail. To reply, visit:
https://reviews.apache.org/r/65073/#review195149
-----------------------------------------------------------



FAIL: mesos-java failed to build.

Reviews applied: `['65073']`

Failed command: `cmake.exe --build . --target mesos-java`

All the build artifacts available at: http://dcos-win.westus.cloudapp.azure.com/mesos-build/review/65073

Relevant logs:

- [mesos-java-build-cmake-stdout.log](http://dcos-win.westus.cloudapp.azure.com/mesos-build/review/65073/logs/mesos-java-build-cmake-stdout.log):

```
  C:\Program Files (x86)\Microsoft Visual Studio\2017\Community\VC\Tools\MSVC\14.12.25827\include\xstring(2139):
fatal error C1088: Cannot flush compiler intermediate file: 'C:\Users\mesos\AppData\Local\Temp_CL_c3b2e693sy':
No space left on device (compiling source file D:\DCOS\mesos\3rdparty\protobuf-3.5.0\src\protobuf-3.5.0\src\google\protobuf\io\zero_copy_stream_impl_lite.cc)
[D:\DCOS\mesos\3rdparty\protobuf-3.5.0\src\protobuf-3.5.0-build\libprotobuf-lite.vcxproj]
[D:\DCOS\mesos\3rdparty\protobuf-3.5.0.vcxproj]
  C:\Program Files (x86)\Microsoft Visual Studio\2017\Community\VC\Tools\MSVC\14.12.25827\include\xutility(276):
fatal error C1088: Cannot flush compiler intermediate file: 'C:\Users\mesos\AppData\Local\Temp_CL_14e565ecex':
No space left on device (compiling source file D:\DCOS\mesos\3rdparty\protobuf-3.5.0\src\protobuf-3.5.0\src\google\protobuf\stubs\stringprintf.cc)
[D:\DCOS\mesos\3rdparty\protobuf-3.5.0\src\protobuf-3.5.0-build\libprotobuf-lite.vcxproj]
[D:\DCOS\mesos\3rdparty\protobuf-3.5.0.vcxproj]
  C:\Program Files (x86)\Microsoft Visual Studio\2017\Community\VC\Tools\MSVC\14.12.25827\include\xlocale(1565):
fatal error C1088: Cannot flush compiler intermediate file: 'C:\Users\mesos\AppData\Local\Temp_CL_cfa0ff90ex':
No space left on device (compiling source file D:\DCOS\mesos\3rdparty\protobuf-3.5.0\src\protobuf-3.5.0\src\google\protobuf\stubs\strutil.cc)
[D:\DCOS\mesos\3rdparty\protobuf-3.5.0\src\protobuf-3.5.0-build\libprotobuf-lite.vcxproj]
[D:\DCOS\mesos\3rdparty\protobuf-3.5.0.vcxproj]
  D:\DCOS\mesos\3rdparty\protobuf-3.5.0\src\protobuf-3.5.0\src\google\protobuf\repeated_field.cc(111):
fatal error C1088: Cannot flush compiler intermediate file: 'C:\Users\mesos\AppData\Local\Temp_CL_d650a1b9gl':
No space left on device [D:\DCOS\mesos\3rdparty\protobuf-3.5.0\src\protobuf-3.5.0-build\libprotobuf-lite.vcxproj]
[D:\DCOS\mesos\3rdparty\protobuf-3.5.0.vcxproj]
  C:\Program Files (x86)\Windows Kits\10\Include\10.0.16299.0\ucrt\corecrt_wstdio.h(336):
fatal error C1088: Cannot flush compiler intermediate file: 'C:\Users\mesos\AppData\Local\Temp_CL_8615d87cex':
No space left on device (compiling source file D:\DCOS\mesos\3rdparty\protobuf-3.5.0\src\protobuf-3.5.0\src\google\protobuf\stubs\io_win32.cc)
[D:\DCOS\mesos\3rdparty\protobuf-3.5.0\src\protobuf-3.5.0-build\libprotobuf-lite.vcxproj]
[D:\DCOS\mesos\3rdparty\protobuf-3.5.0.vcxproj]
  C:\Program Files (x86)\Microsoft Visual Studio\2017\Community\VC\Tools\MSVC\14.12.25827\include\xstring(1566):
fatal error C1088: Cannot flush compiler intermediate file: 'C:\Users\mesos\AppData\Local\Temp_CL_3a4c01f3ex':
No space left on device (compiling source file D:\DCOS\mesos\3rdparty\protobuf-3.5.0\src\protobuf-3.5.0\src\google\protobuf\stubs\time.cc)
[D:\DCOS\mesos\3rdparty\protobuf-3.5.0\src\protobuf-3.5.0-build\libprotobuf-lite.vcxproj]
[D:\DCOS\mesos\3rdparty\protobuf-3.5.0.vcxproj]
  C:\Program Files (x86)\Microsoft Visual Studio\2017\Community\VC\Tools\MSVC\14.12.25827\include\xstring(1828):
fatal error C1088: Cannot flush compiler intermediate file: 'C:\Users\mesos\AppData\Local\Temp_CL_41ea8e8bsy':
No space left on device (compiling source file D:\DCOS\mesos\3rdparty\protobuf-3.5.0\src\protobuf-3.5.0\src\google\protobuf\wire_format_lite.cc)
[D:\DCOS\mesos\3rdparty\protobuf-3.5.0\src\protobuf-3.5.0-build\libprotobuf-lite.vcxproj]
[D:\DCOS\mesos\3rdparty\protobuf-3.5.0.vcxproj]


"D:\DCOS\mesos\src\java\mesos-java.vcxproj" (default target) (1) ->
"D:\DCOS\mesos\3rdparty\libprocess\src\process.vcxproj" (default target) (19) ->
"D:\DCOS\mesos\3rdparty\zlib-1.2.8.vcxproj" (default target) (20) ->
  C:\Users\mesos\AppData\Local\Temp\lnk{7010D1CE-7C73-4B9C-9D46-C5C089C217F0}.tmp : fatal
error LNK1106: invalid file or disk full: cannot seek to 0x8D4 [D:\DCOS\mesos\3rdparty\zlib-1.2.8\src\zlib-1.2.8-build\zlib.vcxproj]
[D:\DCOS\mesos\3rdparty\zlib-1.2.8.vcxproj]
  D:\DCOS\mesos\3rdparty\zlib-1.2.8\src\zlib-1.2.8\gzread.c(595): fatal error C1088: Cannot
flush compiler intermediate file: 'C:\Users\mesos\AppData\Local\Temp_CL_1de10d3csy': No space
left on device [D:\DCOS\mesos\3rdparty\zlib-1.2.8\src\zlib-1.2.8-build\zlibstatic.vcxproj]
[D:\DCOS\mesos\3rdparty\zlib-1.2.8.vcxproj]
  D:\DCOS\mesos\3rdparty\zlib-1.2.8\src\zlib-1.2.8\gzwrite.c(578): fatal error C1088: Cannot
flush compiler intermediate file: 'C:\Users\mesos\AppData\Local\Temp_CL_7f8cf311sy': No space
left on device [D:\DCOS\mesos\3rdparty\zlib-1.2.8\src\zlib-1.2.8-build\zlibstatic.vcxproj]
[D:\DCOS\mesos\3rdparty\zlib-1.2.8.vcxproj]
  C:\Users\mesos\AppData\Local\Temp\lnk{7010D1CE-7C73-4B9C-9D46-C5C089C217F0}.tmp : fatal
error LNK1106: invalid file or disk full: cannot seek to 0x8D4 [D:\DCOS\mesos\3rdparty\zlib-1.2.8\src\zlib-1.2.8-build\zlib.vcxproj]
[D:\DCOS\mesos\3rdparty\zlib-1.2.8.vcxproj]
  D:\DCOS\mesos\3rdparty\zlib-1.2.8\src\zlib-1.2.8\gzread.c(595): fatal error C1088: Cannot
flush compiler intermediate file: 'C:\Users\mesos\AppData\Local\Temp_CL_1de10d3csy': No space
left on device [D:\DCOS\mesos\3rdparty\zlib-1.2.8\src\zlib-1.2.8-build\zlibstatic.vcxproj]
[D:\DCOS\mesos\3rdparty\zlib-1.2.8.vcxproj]
  D:\DCOS\mesos\3rdparty\zlib-1.2.8\src\zlib-1.2.8\gzwrite.c(578): fatal error C1088: Cannot
flush compiler intermediate file: 'C:\Users\mesos\AppData\Local\Temp_CL_7f8cf311sy': No space
left on device [D:\DCOS\mesos\3rdparty\zlib-1.2.8\src\zlib-1.2.8-build\zlibstatic.vcxproj]
[D:\DCOS\mesos\3rdparty\zlib-1.2.8.vcxproj]


"D:\DCOS\mesos\src\java\mesos-java.vcxproj" (default target) (1) ->
"D:\DCOS\mesos\3rdparty\zookeeper-3.4.8.vcxproj" (default target) (21) ->
  LINK : fatal error LNK1104: cannot open file [D:\DCOS\mesos\3rdparty\zookeeper-3.4.8.vcxproj]
  LINK : fatal error LNK1104: cannot open file 'C:\Users\mesos\AppData\Local\Temp\lnk{0E61B64F-08D8-4298-B873-E839B40DA1B5}.tmp'
[D:\DCOS\mesos\3rdparty\zookeeper-3.4.8\src\zookeeper-3.4.8-build\CMakeFiles\CMakeTmp\cmTC_0ef8b.vcxproj]
[D:\DCOS\mesos\3rdparty\zookeeper-3.4.8.vcxproj]

    133 Warning(s)
    216 Error(s)

Time Elapsed 00:09:58.52
```

- [mesos-java-build-CMakeOutput.log](http://dcos-win.westus.cloudapp.azure.com/mesos-build/review/65073/logs/mesos-java-build-CMakeOutput.log):

```
  Creating directory "cmTC_3ea00.dir\Debug\".

  Creating directory "D:\DCOS\mesos\CMakeFiles\CMakeTmp\Debug\".

  Creating directory "cmTC_3ea00.dir\Debug\cmTC_3ea00.tlog\".

InitializeBuildStatus:

  Creating "cmTC_3ea00.dir\Debug\cmTC_3ea00.tlog\unsuccessfulbuild" because "AlwaysCreate"
was specified.

ClCompile:

  C:\Program Files (x86)\Microsoft Visual Studio\2017\Community\VC\Tools\MSVC\14.12.25827\bin\HostX64\x64\CL.exe
/c /Zi /W3 /WX- /diagnostics:classic /Od /Ob0 /D WIN32 /D _WINDOWS /D COMPILER_SUPPORTS_CXX11
/D "CMAKE_INTDIR=\"Debug\"" /D _MBCS /Gm- /EHsc /RTC1 /MDd /GS /fp:precise /Zc:wchar_t /Zc:forScope
/Zc:inline /GR /Fo"cmTC_3ea00.dir\Debug\" /Fd"cmTC_3ea00.dir\Debug\vc141.pdb" /Gd /TP /errorReport:queue
D:\DCOS\mesos\CMakeFiles\CMakeTmp\src.cxx

  Microsoft (R) C/C++ Optimizing Compiler Version 19.12.25830.2 for x64

  Copyright (C) Microsoft Corporation.  All rights reserved.

  

  cl /c /Zi /W3 /WX- /diagnostics:classic /Od /Ob0 /D WIN32 /D _WINDOWS /D COMPILER_SUPPORTS_CXX11
/D "CMAKE_INTDIR=\"Debug\"" /D _MBCS /Gm- /EHsc /RTC1 /MDd /GS /fp:precise /Zc:wchar_t /Zc:forScope
/Zc:inline /GR /Fo"cmTC_3ea00.dir\Debug\" /Fd"cmTC_3ea00.dir\Debug\vc141.pdb" /Gd /TP /errorReport:queue
D:\DCOS\mesos\CMakeFiles\CMakeTmp\src.cxx

  src.cxx

  

Link:

  C:\Program Files (x86)\Microsoft Visual Studio\2017\Community\VC\Tools\MSVC\14.12.25827\bin\HostX64\x64\link.exe
/ERRORREPORT:QUEUE /OUT:"D:\DCOS\mesos\CMakeFiles\CMakeTmp\Debug\cmTC_3ea00.exe" /INCREMENTAL
/NOLOGO kernel32.lib user32.lib gdi32.lib winspool.lib shell32.lib ole32.lib oleaut32.lib
uuid.lib comdlg32.lib advapi32.lib /MANIFEST /MANIFESTUAC:"level='asInvoker' uiAccess='false'"
/manifest:embed /DEBUG /PDB:"D:/DCOS/mesos/CMakeFiles/CMakeTmp/Debug/cmTC_3ea00.pdb" /SUBSYSTEM:CONSOLE
/TLBID:1 /DYNAMICBASE /NXCOMPAT /IMPLIB:"D:/DCOS/mesos/CMakeFiles/CMakeTmp/Debug/cmTC_3ea00.lib"
/MACHINE:X64  /machine:x64 cmTC_3ea00.dir\Debug\src.obj

  cmTC_3ea00.vcxproj -> D:\DCOS\mesos\CMakeFiles\CMakeTmp\Debug\cmTC_3ea00.exe

FinalizeBuildStatus:

  Deleting file "cmTC_3ea00.dir\Debug\cmTC_3ea00.tlog\unsuccessfulbuild".

  Touching "cmTC_3ea00.dir\Debug\cmTC_3ea00.tlog\cmTC_3ea00.lastbuildstate".

Done Building Project "D:\DCOS\mesos\CMakeFiles\CMakeTmp\cmTC_3ea00.vcxproj" (default targets).



Build succeeded.

    0 Warning(s)

    0 Error(s)



Time Elapsed 00:00:01.21


Source file was:
int main() { return 0; }
```

- [mesos-java-build-CMakeError.log](http://dcos-win.westus.cloudapp.azure.com/mesos-build/review/65073/logs/mesos-java-build-CMakeError.log):

```
PrepareForBuild:

  Creating directory "cmTC_d32d5.dir\Debug\".

  Creating directory "D:\DCOS\mesos\CMakeFiles\CMakeTmp\Debug\".

  Creating directory "cmTC_d32d5.dir\Debug\cmTC_d32d5.tlog\".

InitializeBuildStatus:

  Creating "cmTC_d32d5.dir\Debug\cmTC_d32d5.tlog\unsuccessfulbuild" because "AlwaysCreate"
was specified.

ClCompile:

  C:\Program Files (x86)\Microsoft Visual Studio\2017\Community\VC\Tools\MSVC\14.12.25827\bin\HostX64\x64\CL.exe
/c /Zi /W3 /WX- /diagnostics:classic /MP /Od /Ob0 /D WIN32 /D _WINDOWS /D UNICODE /D _UNICODE
/D "CMAKE_INTDIR=\"Debug\"" /D _UNICODE /D UNICODE /Gm- /RTC1 /MTd /GS /fp:precise /Zc:wchar_t
/Zc:forScope /Zc:inline /Fo"cmTC_d32d5.dir\Debug\" /Fd"cmTC_d32d5.dir\Debug\vc141.pdb" /Gd
/TC /errorReport:queue D:\DCOS\mesos\CMakeFiles\CMakeTmp\CheckIncludeFile.c

  Microsoft (R) C/C++ Optimizing Compiler Version 19.12.25830.2 for x64

  Copyright (C) Microsoft Corporation.  All rights reserved.

  

  cl /c /Zi /W3 /WX- /diagnostics:classic /MP /Od /Ob0 /D WIN32 /D _WINDOWS /D UNICODE /D
_UNICODE /D "CMAKE_INTDIR=\"Debug\"" /D _UNICODE /D UNICODE /Gm- /RTC1 /MTd /GS /fp:precise
/Zc:wchar_t /Zc:forScope /Zc:inline /Fo"cmTC_d32d5.dir\Debug\" /Fd"cmTC_d32d5.dir\Debug\vc141.pdb"
/Gd /TC /errorReport:queue D:\DCOS\mesos\CMakeFiles\CMakeTmp\CheckIncludeFile.c

  CheckIncludeFile.c

  

D:\DCOS\mesos\CMakeFiles\CMakeTmp\CheckIncludeFile.c(1): fatal error C1083: Cannot open include
file: 'pthread.h': No such file or directory [D:\DCOS\mesos\CMakeFiles\CMakeTmp\cmTC_d32d5.vcxproj]

Done Building Project "D:\DCOS\mesos\CMakeFiles\CMakeTmp\cmTC_d32d5.vcxproj" (default targets)
-- FAILED.



Build FAILED.



"D:\DCOS\mesos\CMakeFiles\CMakeTmp\cmTC_d32d5.vcxproj" (default target) (1) ->

(ClCompile target) -> 

  D:\DCOS\mesos\CMakeFiles\CMakeTmp\CheckIncludeFile.c(1): fatal error C1083: Cannot open
include file: 'pthread.h': No such file or directory [D:\DCOS\mesos\CMakeFiles\CMakeTmp\cmTC_d32d5.vcxproj]



    0 Warning(s)

    1 Error(s)



Time Elapsed 00:00:00.57



```

- Mesos Reviewbot Windows


On Jan. 10, 2018, 7:28 a.m., Benjamin Bannier wrote:
> 
> -----------------------------------------------------------
> This is an automatically generated e-mail. To reply, visit:
> https://reviews.apache.org/r/65073/
> -----------------------------------------------------------
> 
> (Updated Jan. 10, 2018, 7:28 a.m.)
> 
> 
> Review request for mesos and Armand Grillet.
> 
> 
> Repository: mesos
> 
> 
> Description
> -------
> 
> The post-reviews script allows to specify the tracking branch against
> which to post reviews; we default to creating patches against
> `master`.
> 
> The script also contains some protection against posting reviews from
> the tracking branch, but this protection seems to predate the tracking
> branch configuration flag. Instead we also disallow posting patches
> from the `master` branch, even if the tracking branch is not `master`.
> 
> This patch fixes this sanity check to check that the current and
> tracking branch are different.
> 
> 
> Diffs
> -----
> 
>   support/post-reviews.py 7e3f0f48f7e9019b68c074eb85c17255a3b4390e 
> 
> 
> Diff: https://reviews.apache.org/r/65073/diff/1/
> 
> 
> Testing
> -------
> 
> Successfully posted this patch from `master` against `origin/master`.
> 
> 
> Thanks,
> 
> Benjamin Bannier
> 
>


Mime
  • Unnamed multipart/alternative (inline, None, 0 bytes)
View raw message