mesos-reviews mailing list archives

Site index · List index
Message view « Date » · « Thread »
Top « Date » · « Thread »
From Mesos Reviewbot Windows <revi...@mesos.apache.org>
Subject Re: Review Request 65071: Fixed composing containerizer hanging in `wait()` after recovery.
Date Wed, 10 Jan 2018 17:38:57 GMT

-----------------------------------------------------------
This is an automatically generated e-mail. To reply, visit:
https://reviews.apache.org/r/65071/#review195145
-----------------------------------------------------------



FAIL: mesos-java failed to build.

Reviews applied: `['65071']`

Failed command: `cmake.exe --build . --target mesos-java`

All the build artifacts available at: http://dcos-win.westus.cloudapp.azure.com/mesos-build/review/65071

Relevant logs:

- [mesos-java-build-cmake-stdout.log](http://dcos-win.westus.cloudapp.azure.com/mesos-build/review/65071/logs/mesos-java-build-cmake-stdout.log):

```
  D:\DCOS\mesos\3rdparty\zookeeper-3.4.8\src\zookeeper-3.4.8\src\c\src\cli.c(569): warning
C4996: 'strcpy': This function or variable may be unsafe. Consider using strcpy_s instead.
To disable deprecation, use _CRT_SECURE_NO_WARNINGS. See online help for details. [D:\DCOS\mesos\3rdparty\zookeeper-3.4.8\src\zookeeper-3.4.8-build\cli.vcxproj]
[D:\DCOS\mesos\3rdparty\zookeeper-3.4.8.vcxproj]


"D:\DCOS\mesos\src\java\mesos-java.vcxproj" (default target) (1) ->
"D:\DCOS\mesos\3rdparty\libprocess\src\process.vcxproj" (default target) (19) ->
(ClCompile target) -> 
  C:\Program Files (x86)\Microsoft Visual Studio\2017\Community\VC\Tools\MSVC\14.12.25827\include\xhash(1087):
fatal error C1088: Cannot flush compiler intermediate file: 'C:\Users\mesos\AppData\Local\Temp_CL_60edbf18ex':
No space left on device (compiling source file D:\DCOS\mesos\mesos\3rdparty\libprocess\src\firewall.cpp)
[D:\DCOS\mesos\3rdparty\libprocess\src\process.vcxproj]
  C:\Program Files (x86)\Microsoft Visual Studio\2017\Community\VC\Tools\MSVC\14.12.25827\include\xhash(1021):
fatal error C1088: Cannot flush compiler intermediate file: 'C:\Users\mesos\AppData\Local\Temp_CL_e1242de4ex':
No space left on device (compiling source file D:\DCOS\mesos\mesos\3rdparty\libprocess\src\io.cpp)
[D:\DCOS\mesos\3rdparty\libprocess\src\process.vcxproj]
  C:\Program Files (x86)\Microsoft Visual Studio\2017\Community\VC\Tools\MSVC\14.12.25827\include\xtree(1884):
fatal error C1088: Cannot flush compiler intermediate file: 'C:\Users\mesos\AppData\Local\Temp_CL_a6a9acbcex':
No space left on device (compiling source file D:\DCOS\mesos\mesos\3rdparty\libprocess\src\clock.cpp)
[D:\DCOS\mesos\3rdparty\libprocess\src\process.vcxproj]
  C:\Program Files (x86)\Microsoft Visual Studio\2017\Community\VC\Tools\MSVC\14.12.25827\include\xhash(605):
fatal error C1088: Cannot flush compiler intermediate file: 'C:\Users\mesos\AppData\Local\Temp_CL_3a2c7832ex':
No space left on device (compiling source file D:\DCOS\mesos\mesos\3rdparty\libprocess\src\authenticator_manager.cpp)
[D:\DCOS\mesos\3rdparty\libprocess\src\process.vcxproj]
  C:\Program Files (x86)\Microsoft Visual Studio\2017\Community\VC\Tools\MSVC\14.12.25827\include\initializer_list(52):
fatal error C1088: Cannot flush compiler intermediate file: 'C:\Users\mesos\AppData\Local\Temp_CL_44305e1cex':
No space left on device (compiling source file D:\DCOS\mesos\mesos\3rdparty\libprocess\src\http.cpp)
[D:\DCOS\mesos\3rdparty\libprocess\src\process.vcxproj]
  D:\DCOS\mesos\3rdparty\boost-1.53.0\src\boost-1.53.0\boost/lexical_cast.hpp(969): fatal
error C1088: Cannot flush compiler intermediate file: 'C:\Users\mesos\AppData\Local\Temp_CL_a9425872ex':
No space left on device (compiling source file D:\DCOS\mesos\mesos\3rdparty\libprocess\src\help.cpp)
[D:\DCOS\mesos\3rdparty\libprocess\src\process.vcxproj]
  D:\DCOS\mesos\mesos\3rdparty\libprocess\src\latch.cpp(78): fatal error C1088: Cannot flush
compiler intermediate file: 'C:\Users\mesos\AppData\Local\Temp_CL_a0725e1bgl': No space left
on device [D:\DCOS\mesos\3rdparty\libprocess\src\process.vcxproj]
  C:\Program Files (x86)\Microsoft Visual Studio\2017\Community\VC\Tools\MSVC\14.12.25827\include\memory(2341):
fatal error C1088: Cannot flush compiler intermediate file: 'C:\Users\mesos\AppData\Local\Temp_CL_17d7e334ex':
No space left on device (compiling source file D:\DCOS\mesos\mesos\3rdparty\libprocess\src\poll_socket.cpp)
[D:\DCOS\mesos\3rdparty\libprocess\src\process.vcxproj]
  C:\Program Files (x86)\Microsoft Visual Studio\2017\Community\VC\Tools\MSVC\14.12.25827\include\xxatomic(803):
fatal error C1088: Cannot flush compiler intermediate file: 'C:\Users\mesos\AppData\Local\Temp_CL_7a4d7b51ex':
No space left on device (compiling source file D:\DCOS\mesos\mesos\3rdparty\libprocess\src\reap.cpp)
[D:\DCOS\mesos\3rdparty\libprocess\src\process.vcxproj]
  D:\DCOS\mesos\mesos\3rdparty\libprocess\include\process/future.hpp(376): fatal error C1088:
Cannot flush compiler intermediate file: 'C:\Users\mesos\AppData\Local\Temp_CL_709eaee4ex':
No space left on device (compiling source file D:\DCOS\mesos\mesos\3rdparty\libprocess\src\logging.cpp)
[D:\DCOS\mesos\3rdparty\libprocess\src\process.vcxproj]
  D:\DCOS\mesos\mesos\3rdparty\stout\include\stout/os.hpp(199): fatal error C1088: Cannot
flush compiler intermediate file: 'C:\Users\mesos\AppData\Local\Temp_CL_764e9bc8ex': No space
left on device (compiling source file D:\DCOS\mesos\mesos\3rdparty\libprocess\src\process.cpp)
[D:\DCOS\mesos\3rdparty\libprocess\src\process.vcxproj]
  C:\Program Files (x86)\Microsoft Visual Studio\2017\Community\VC\Tools\MSVC\14.12.25827\include\xlocnum(134):
fatal error C1088: Cannot flush compiler intermediate file: 'C:\Users\mesos\AppData\Local\Temp_CL_3cef1715ex':
No space left on device (compiling source file D:\DCOS\mesos\mesos\3rdparty\libprocess\src\libevent_poll.cpp)
[D:\DCOS\mesos\3rdparty\libprocess\src\process.vcxproj]
  C:\Program Files (x86)\Microsoft Visual Studio\2017\Community\VC\Tools\MSVC\14.12.25827\include\functional(513):
fatal error C1088: Cannot flush compiler intermediate file: 'C:\Users\mesos\AppData\Local\Temp_CL_09330304ex':
No space left on device (compiling source file D:\DCOS\mesos\mesos\3rdparty\libprocess\src\libevent.cpp)
[D:\DCOS\mesos\3rdparty\libprocess\src\process.vcxproj]
  C:\Program Files (x86)\Microsoft Visual Studio\2017\Community\VC\Tools\MSVC\14.12.25827\include\utility(77):
fatal error C1088: Cannot flush compiler intermediate file: 'C:\Users\mesos\AppData\Local\Temp_CL_27371893ex':
No space left on device (compiling source file D:\DCOS\mesos\mesos\3rdparty\libprocess\src\subprocess_windows.cpp)
[D:\DCOS\mesos\3rdparty\libprocess\src\process.vcxproj]
  D:\DCOS\mesos\3rdparty\boost-1.53.0\src\boost-1.53.0\boost/variant/variant.hpp(1103): fatal
error C1088: Cannot flush compiler intermediate file: 'C:\Users\mesos\AppData\Local\Temp_CL_d280a259ex':
No space left on device (compiling source file D:\DCOS\mesos\mesos\3rdparty\libprocess\src\jwt.cpp)
[D:\DCOS\mesos\3rdparty\libprocess\src\process.vcxproj]
  D:\DCOS\mesos\mesos\3rdparty\libprocess\src\metrics\metrics.cpp(261): fatal error C1088:
Cannot flush compiler intermediate file: 'C:\Users\mesos\AppData\Local\Temp_CL_9e1ecd05db':
No space left on device [D:\DCOS\mesos\3rdparty\libprocess\src\process.vcxproj]
  D:\DCOS\mesos\mesos\3rdparty\stout\include\stout/bytes.hpp(110): fatal error C1088: Cannot
flush compiler intermediate file: 'C:\Users\mesos\AppData\Local\Temp_CL_751661d4ex': No space
left on device (compiling source file D:\DCOS\mesos\mesos\3rdparty\libprocess\src\ssl\utilities.cpp)
[D:\DCOS\mesos\3rdparty\libprocess\src\process.vcxproj]
  C:\Program Files (x86)\Microsoft Visual Studio\2017\Community\VC\Tools\MSVC\14.12.25827\include\vector(1997):
fatal error C1088: Cannot flush compiler intermediate file: 'C:\Users\mesos\AppData\Local\Temp_CL_27c49a18ex':
No space left on device (compiling source file D:\DCOS\mesos\mesos\3rdparty\libprocess\src\socket.cpp)
[D:\DCOS\mesos\3rdparty\libprocess\src\process.vcxproj]

    195 Warning(s)
    18 Error(s)

Time Elapsed 00:17:32.69
```

- [mesos-java-build-CMakeOutput.log](http://dcos-win.westus.cloudapp.azure.com/mesos-build/review/65071/logs/mesos-java-build-CMakeOutput.log):

```
  Creating directory "cmTC_dfa4f.dir\Debug\".

  Creating directory "D:\DCOS\mesos\CMakeFiles\CMakeTmp\Debug\".

  Creating directory "cmTC_dfa4f.dir\Debug\cmTC_dfa4f.tlog\".

InitializeBuildStatus:

  Creating "cmTC_dfa4f.dir\Debug\cmTC_dfa4f.tlog\unsuccessfulbuild" because "AlwaysCreate"
was specified.

ClCompile:

  C:\Program Files (x86)\Microsoft Visual Studio\2017\Community\VC\Tools\MSVC\14.12.25827\bin\HostX64\x64\CL.exe
/c /Zi /W3 /WX- /diagnostics:classic /Od /Ob0 /D WIN32 /D _WINDOWS /D COMPILER_SUPPORTS_CXX11
/D "CMAKE_INTDIR=\"Debug\"" /D _MBCS /Gm- /EHsc /RTC1 /MDd /GS /fp:precise /Zc:wchar_t /Zc:forScope
/Zc:inline /GR /Fo"cmTC_dfa4f.dir\Debug\" /Fd"cmTC_dfa4f.dir\Debug\vc141.pdb" /Gd /TP /errorReport:queue
D:\DCOS\mesos\CMakeFiles\CMakeTmp\src.cxx

  Microsoft (R) C/C++ Optimizing Compiler Version 19.12.25830.2 for x64

  Copyright (C) Microsoft Corporation.  All rights reserved.

  

  cl /c /Zi /W3 /WX- /diagnostics:classic /Od /Ob0 /D WIN32 /D _WINDOWS /D COMPILER_SUPPORTS_CXX11
/D "CMAKE_INTDIR=\"Debug\"" /D _MBCS /Gm- /EHsc /RTC1 /MDd /GS /fp:precise /Zc:wchar_t /Zc:forScope
/Zc:inline /GR /Fo"cmTC_dfa4f.dir\Debug\" /Fd"cmTC_dfa4f.dir\Debug\vc141.pdb" /Gd /TP /errorReport:queue
D:\DCOS\mesos\CMakeFiles\CMakeTmp\src.cxx

  src.cxx

  

Link:

  C:\Program Files (x86)\Microsoft Visual Studio\2017\Community\VC\Tools\MSVC\14.12.25827\bin\HostX64\x64\link.exe
/ERRORREPORT:QUEUE /OUT:"D:\DCOS\mesos\CMakeFiles\CMakeTmp\Debug\cmTC_dfa4f.exe" /INCREMENTAL
/NOLOGO kernel32.lib user32.lib gdi32.lib winspool.lib shell32.lib ole32.lib oleaut32.lib
uuid.lib comdlg32.lib advapi32.lib /MANIFEST /MANIFESTUAC:"level='asInvoker' uiAccess='false'"
/manifest:embed /DEBUG /PDB:"D:/DCOS/mesos/CMakeFiles/CMakeTmp/Debug/cmTC_dfa4f.pdb" /SUBSYSTEM:CONSOLE
/TLBID:1 /DYNAMICBASE /NXCOMPAT /IMPLIB:"D:/DCOS/mesos/CMakeFiles/CMakeTmp/Debug/cmTC_dfa4f.lib"
/MACHINE:X64  /machine:x64 cmTC_dfa4f.dir\Debug\src.obj

  cmTC_dfa4f.vcxproj -> D:\DCOS\mesos\CMakeFiles\CMakeTmp\Debug\cmTC_dfa4f.exe

FinalizeBuildStatus:

  Deleting file "cmTC_dfa4f.dir\Debug\cmTC_dfa4f.tlog\unsuccessfulbuild".

  Touching "cmTC_dfa4f.dir\Debug\cmTC_dfa4f.tlog\cmTC_dfa4f.lastbuildstate".

Done Building Project "D:\DCOS\mesos\CMakeFiles\CMakeTmp\cmTC_dfa4f.vcxproj" (default targets).



Build succeeded.

    0 Warning(s)

    0 Error(s)



Time Elapsed 00:00:01.21


Source file was:
int main() { return 0; }
```

- [mesos-java-build-CMakeError.log](http://dcos-win.westus.cloudapp.azure.com/mesos-build/review/65071/logs/mesos-java-build-CMakeError.log):

```
PrepareForBuild:

  Creating directory "cmTC_f4d59.dir\Debug\".

  Creating directory "D:\DCOS\mesos\CMakeFiles\CMakeTmp\Debug\".

  Creating directory "cmTC_f4d59.dir\Debug\cmTC_f4d59.tlog\".

InitializeBuildStatus:

  Creating "cmTC_f4d59.dir\Debug\cmTC_f4d59.tlog\unsuccessfulbuild" because "AlwaysCreate"
was specified.

ClCompile:

  C:\Program Files (x86)\Microsoft Visual Studio\2017\Community\VC\Tools\MSVC\14.12.25827\bin\HostX64\x64\CL.exe
/c /Zi /W3 /WX- /diagnostics:classic /MP /Od /Ob0 /D WIN32 /D _WINDOWS /D UNICODE /D _UNICODE
/D "CMAKE_INTDIR=\"Debug\"" /D _UNICODE /D UNICODE /Gm- /RTC1 /MTd /GS /fp:precise /Zc:wchar_t
/Zc:forScope /Zc:inline /Fo"cmTC_f4d59.dir\Debug\" /Fd"cmTC_f4d59.dir\Debug\vc141.pdb" /Gd
/TC /errorReport:queue D:\DCOS\mesos\CMakeFiles\CMakeTmp\CheckIncludeFile.c

  Microsoft (R) C/C++ Optimizing Compiler Version 19.12.25830.2 for x64

  Copyright (C) Microsoft Corporation.  All rights reserved.

  

  cl /c /Zi /W3 /WX- /diagnostics:classic /MP /Od /Ob0 /D WIN32 /D _WINDOWS /D UNICODE /D
_UNICODE /D "CMAKE_INTDIR=\"Debug\"" /D _UNICODE /D UNICODE /Gm- /RTC1 /MTd /GS /fp:precise
/Zc:wchar_t /Zc:forScope /Zc:inline /Fo"cmTC_f4d59.dir\Debug\" /Fd"cmTC_f4d59.dir\Debug\vc141.pdb"
/Gd /TC /errorReport:queue D:\DCOS\mesos\CMakeFiles\CMakeTmp\CheckIncludeFile.c

  CheckIncludeFile.c

  

D:\DCOS\mesos\CMakeFiles\CMakeTmp\CheckIncludeFile.c(1): fatal error C1083: Cannot open include
file: 'pthread.h': No such file or directory [D:\DCOS\mesos\CMakeFiles\CMakeTmp\cmTC_f4d59.vcxproj]

Done Building Project "D:\DCOS\mesos\CMakeFiles\CMakeTmp\cmTC_f4d59.vcxproj" (default targets)
-- FAILED.



Build FAILED.



"D:\DCOS\mesos\CMakeFiles\CMakeTmp\cmTC_f4d59.vcxproj" (default target) (1) ->

(ClCompile target) -> 

  D:\DCOS\mesos\CMakeFiles\CMakeTmp\CheckIncludeFile.c(1): fatal error C1083: Cannot open
include file: 'pthread.h': No such file or directory [D:\DCOS\mesos\CMakeFiles\CMakeTmp\cmTC_f4d59.vcxproj]



    0 Warning(s)

    1 Error(s)



Time Elapsed 00:00:00.58



```

- Mesos Reviewbot Windows


On Jan. 10, 2018, 3:13 p.m., Andrei Budnik wrote:
> 
> -----------------------------------------------------------
> This is an automatically generated e-mail. To reply, visit:
> https://reviews.apache.org/r/65071/
> -----------------------------------------------------------
> 
> (Updated Jan. 10, 2018, 3:13 p.m.)
> 
> 
> Review request for mesos, Alexander Rukletsov, Gilbert Song, and Jie Yu.
> 
> 
> Bugs: MESOS-8391
>     https://issues.apache.org/jira/browse/MESOS-8391
> 
> 
> Repository: mesos
> 
> 
> Description
> -------
> 
> This patch fixes the issue when `wait()` of composing containerizer
> returns a future that is never set to `READY` state due to a missing
> `wait()` call on corresponding containerizer after it's recovery.
> It is necessary to call `wait()` for each known container of composing
> containerizer, because any terminated container should be handled in
> `_destroy()` callback that is bound to that `wait()`.
> 
> 
> Diffs
> -----
> 
>   src/slave/containerizer/composing.cpp 9ace70d9fbd78182715c5ef13fcaf7ad45f76f97 
> 
> 
> Diff: https://reviews.apache.org/r/65071/diff/1/
> 
> 
> Testing
> -------
> 
> sudo make check (fedora 25)
> 
> 
> Thanks,
> 
> Andrei Budnik
> 
>


Mime
  • Unnamed multipart/alternative (inline, None, 0 bytes)
View raw message