mesos-reviews mailing list archives

Site index · List index
Message view « Date » · « Thread »
Top « Date » · « Thread »
From Mesos Reviewbot Windows <revi...@mesos.apache.org>
Subject Re: Review Request 65042: Adjusted CSI example framework for recent changes.
Date Wed, 10 Jan 2018 10:28:51 GMT

-----------------------------------------------------------
This is an automatically generated e-mail. To reply, visit:
https://reviews.apache.org/r/65042/#review195124
-----------------------------------------------------------



FAIL: mesos-java failed to build.

Reviews applied: `['64932', '65042']`

Failed command: `cmake.exe --build . --target mesos-java`

All the build artifacts available at: http://dcos-win.westus.cloudapp.azure.com/mesos-build/review/65042

Relevant logs:

- [mesos-java-build-cmake-stdout.log](http://dcos-win.westus.cloudapp.azure.com/mesos-build/review/65042/logs/mesos-java-build-cmake-stdout.log):

```
  D:\DCOS\mesos\3rdparty\zookeeper-3.4.8\src\zookeeper-3.4.8\src\c\src\cli.c(301): warning
C4267: 'initializing': conversion from 'size_t' to 'int', possible loss of data [D:\DCOS\mesos\3rdparty\zookeeper-3.4.8\src\zookeeper-3.4.8-build\cli.vcxproj]
[D:\DCOS\mesos\3rdparty\zookeeper-3.4.8.vcxproj]
  D:\DCOS\mesos\3rdparty\zookeeper-3.4.8\src\zookeeper-3.4.8\src\c\src\cli.c(368): warning
C4267: 'function': conversion from 'size_t' to 'int', possible loss of data [D:\DCOS\mesos\3rdparty\zookeeper-3.4.8\src\zookeeper-3.4.8-build\cli.vcxproj]
[D:\DCOS\mesos\3rdparty\zookeeper-3.4.8.vcxproj]
  D:\DCOS\mesos\3rdparty\zookeeper-3.4.8\src\zookeeper-3.4.8\src\c\src\cli.c(372): warning
C4267: 'function': conversion from 'size_t' to 'int', possible loss of data [D:\DCOS\mesos\3rdparty\zookeeper-3.4.8\src\zookeeper-3.4.8-build\cli.vcxproj]
[D:\DCOS\mesos\3rdparty\zookeeper-3.4.8.vcxproj]
  D:\DCOS\mesos\3rdparty\zookeeper-3.4.8\src\zookeeper-3.4.8\src\c\src\cli.c(512): warning
C4267: 'function': conversion from 'size_t' to 'int', possible loss of data [D:\DCOS\mesos\3rdparty\zookeeper-3.4.8\src\zookeeper-3.4.8-build\cli.vcxproj]
[D:\DCOS\mesos\3rdparty\zookeeper-3.4.8.vcxproj]
  D:\DCOS\mesos\3rdparty\zookeeper-3.4.8\src\zookeeper-3.4.8\src\c\src\cli.c(543): warning
C4996: 'strcpy': This function or variable may be unsafe. Consider using strcpy_s instead.
To disable deprecation, use _CRT_SECURE_NO_WARNINGS. See online help for details. [D:\DCOS\mesos\3rdparty\zookeeper-3.4.8\src\zookeeper-3.4.8-build\cli.vcxproj]
[D:\DCOS\mesos\3rdparty\zookeeper-3.4.8.vcxproj]
  D:\DCOS\mesos\3rdparty\zookeeper-3.4.8\src\zookeeper-3.4.8\src\c\src\cli.c(548): warning
C4996: 'fopen': This function or variable may be unsafe. Consider using fopen_s instead. To
disable deprecation, use _CRT_SECURE_NO_WARNINGS. See online help for details. [D:\DCOS\mesos\3rdparty\zookeeper-3.4.8\src\zookeeper-3.4.8-build\cli.vcxproj]
[D:\DCOS\mesos\3rdparty\zookeeper-3.4.8.vcxproj]
  D:\DCOS\mesos\3rdparty\zookeeper-3.4.8\src\zookeeper-3.4.8\src\c\src\cli.c(569): warning
C4996: 'strcpy': This function or variable may be unsafe. Consider using strcpy_s instead.
To disable deprecation, use _CRT_SECURE_NO_WARNINGS. See online help for details. [D:\DCOS\mesos\3rdparty\zookeeper-3.4.8\src\zookeeper-3.4.8-build\cli.vcxproj]
[D:\DCOS\mesos\3rdparty\zookeeper-3.4.8.vcxproj]


"D:\DCOS\mesos\src\java\mesos-java.vcxproj" (default target) (1) ->
"D:\DCOS\mesos\3rdparty\curl-7.57.0.vcxproj" (default target) (5) ->
(CustomBuild target) -> 
  CUSTOMBUILD : error : downloading 'https://github.com/mesos/3rdparty/raw/master/curl-7.57.0.tar.gz'
failed [D:\DCOS\mesos\3rdparty\curl-7.57.0.vcxproj]
  CUSTOMBUILD : The requested URL returned error : 503 Service Unavailable [D:\DCOS\mesos\3rdparty\curl-7.57.0.vcxproj]
  CUSTOMBUILD : error : downloading 'https://github.com/mesos/3rdparty/raw/master/curl-7.57.0.tar.gz'
failed [D:\DCOS\mesos\3rdparty\curl-7.57.0.vcxproj]
  CUSTOMBUILD : The requested URL returned error : 503 Service Unavailable [D:\DCOS\mesos\3rdparty\curl-7.57.0.vcxproj]
  CUSTOMBUILD : error : downloading 'https://github.com/mesos/3rdparty/raw/master/curl-7.57.0.tar.gz'
failed [D:\DCOS\mesos\3rdparty\curl-7.57.0.vcxproj]
  CUSTOMBUILD : The requested URL returned error : 503 Service Unavailable [D:\DCOS\mesos\3rdparty\curl-7.57.0.vcxproj]
  CUSTOMBUILD : error : downloading 'https://github.com/mesos/3rdparty/raw/master/curl-7.57.0.tar.gz'
failed [D:\DCOS\mesos\3rdparty\curl-7.57.0.vcxproj]
  CUSTOMBUILD : The requested URL returned error : 503 Service Unavailable [D:\DCOS\mesos\3rdparty\curl-7.57.0.vcxproj]
  CUSTOMBUILD : error : downloading 'https://github.com/mesos/3rdparty/raw/master/curl-7.57.0.tar.gz'
failed [D:\DCOS\mesos\3rdparty\curl-7.57.0.vcxproj]
  CUSTOMBUILD : The requested URL returned error : 503 Service Unavailable [D:\DCOS\mesos\3rdparty\curl-7.57.0.vcxproj]
  CUSTOMBUILD : error : downloading 'https://github.com/mesos/3rdparty/raw/master/curl-7.57.0.tar.gz'
failed [D:\DCOS\mesos\3rdparty\curl-7.57.0.vcxproj]
  CUSTOMBUILD : The requested URL returned error : 503 Service Unavailable [D:\DCOS\mesos\3rdparty\curl-7.57.0.vcxproj]

    190 Warning(s)
    12 Error(s)

Time Elapsed 00:17:27.79
```

- [mesos-java-build-CMakeOutput.log](http://dcos-win.westus.cloudapp.azure.com/mesos-build/review/65042/logs/mesos-java-build-CMakeOutput.log):

```
  Creating directory "cmTC_daf4a.dir\Debug\".

  Creating directory "D:\DCOS\mesos\CMakeFiles\CMakeTmp\Debug\".

  Creating directory "cmTC_daf4a.dir\Debug\cmTC_daf4a.tlog\".

InitializeBuildStatus:

  Creating "cmTC_daf4a.dir\Debug\cmTC_daf4a.tlog\unsuccessfulbuild" because "AlwaysCreate"
was specified.

ClCompile:

  C:\Program Files (x86)\Microsoft Visual Studio\2017\Community\VC\Tools\MSVC\14.12.25827\bin\HostX64\x64\CL.exe
/c /Zi /W3 /WX- /diagnostics:classic /Od /Ob0 /D WIN32 /D _WINDOWS /D COMPILER_SUPPORTS_CXX11
/D "CMAKE_INTDIR=\"Debug\"" /D _MBCS /Gm- /EHsc /RTC1 /MDd /GS /fp:precise /Zc:wchar_t /Zc:forScope
/Zc:inline /GR /Fo"cmTC_daf4a.dir\Debug\" /Fd"cmTC_daf4a.dir\Debug\vc141.pdb" /Gd /TP /errorReport:queue
D:\DCOS\mesos\CMakeFiles\CMakeTmp\src.cxx

  Microsoft (R) C/C++ Optimizing Compiler Version 19.12.25830.2 for x64

  Copyright (C) Microsoft Corporation.  All rights reserved.

  

  cl /c /Zi /W3 /WX- /diagnostics:classic /Od /Ob0 /D WIN32 /D _WINDOWS /D COMPILER_SUPPORTS_CXX11
/D "CMAKE_INTDIR=\"Debug\"" /D _MBCS /Gm- /EHsc /RTC1 /MDd /GS /fp:precise /Zc:wchar_t /Zc:forScope
/Zc:inline /GR /Fo"cmTC_daf4a.dir\Debug\" /Fd"cmTC_daf4a.dir\Debug\vc141.pdb" /Gd /TP /errorReport:queue
D:\DCOS\mesos\CMakeFiles\CMakeTmp\src.cxx

  src.cxx

  

Link:

  C:\Program Files (x86)\Microsoft Visual Studio\2017\Community\VC\Tools\MSVC\14.12.25827\bin\HostX64\x64\link.exe
/ERRORREPORT:QUEUE /OUT:"D:\DCOS\mesos\CMakeFiles\CMakeTmp\Debug\cmTC_daf4a.exe" /INCREMENTAL
/NOLOGO kernel32.lib user32.lib gdi32.lib winspool.lib shell32.lib ole32.lib oleaut32.lib
uuid.lib comdlg32.lib advapi32.lib /MANIFEST /MANIFESTUAC:"level='asInvoker' uiAccess='false'"
/manifest:embed /DEBUG /PDB:"D:/DCOS/mesos/CMakeFiles/CMakeTmp/Debug/cmTC_daf4a.pdb" /SUBSYSTEM:CONSOLE
/TLBID:1 /DYNAMICBASE /NXCOMPAT /IMPLIB:"D:/DCOS/mesos/CMakeFiles/CMakeTmp/Debug/cmTC_daf4a.lib"
/MACHINE:X64  /machine:x64 cmTC_daf4a.dir\Debug\src.obj

  cmTC_daf4a.vcxproj -> D:\DCOS\mesos\CMakeFiles\CMakeTmp\Debug\cmTC_daf4a.exe

FinalizeBuildStatus:

  Deleting file "cmTC_daf4a.dir\Debug\cmTC_daf4a.tlog\unsuccessfulbuild".

  Touching "cmTC_daf4a.dir\Debug\cmTC_daf4a.tlog\cmTC_daf4a.lastbuildstate".

Done Building Project "D:\DCOS\mesos\CMakeFiles\CMakeTmp\cmTC_daf4a.vcxproj" (default targets).



Build succeeded.

    0 Warning(s)

    0 Error(s)



Time Elapsed 00:00:01.18


Source file was:
int main() { return 0; }
```

- [mesos-java-build-CMakeError.log](http://dcos-win.westus.cloudapp.azure.com/mesos-build/review/65042/logs/mesos-java-build-CMakeError.log):

```
PrepareForBuild:

  Creating directory "cmTC_80721.dir\Debug\".

  Creating directory "D:\DCOS\mesos\CMakeFiles\CMakeTmp\Debug\".

  Creating directory "cmTC_80721.dir\Debug\cmTC_80721.tlog\".

InitializeBuildStatus:

  Creating "cmTC_80721.dir\Debug\cmTC_80721.tlog\unsuccessfulbuild" because "AlwaysCreate"
was specified.

ClCompile:

  C:\Program Files (x86)\Microsoft Visual Studio\2017\Community\VC\Tools\MSVC\14.12.25827\bin\HostX64\x64\CL.exe
/c /Zi /W3 /WX- /diagnostics:classic /MP /Od /Ob0 /D WIN32 /D _WINDOWS /D UNICODE /D _UNICODE
/D "CMAKE_INTDIR=\"Debug\"" /D _UNICODE /D UNICODE /Gm- /RTC1 /MTd /GS /fp:precise /Zc:wchar_t
/Zc:forScope /Zc:inline /Fo"cmTC_80721.dir\Debug\" /Fd"cmTC_80721.dir\Debug\vc141.pdb" /Gd
/TC /errorReport:queue D:\DCOS\mesos\CMakeFiles\CMakeTmp\CheckIncludeFile.c

  Microsoft (R) C/C++ Optimizing Compiler Version 19.12.25830.2 for x64

  Copyright (C) Microsoft Corporation.  All rights reserved.

  

  cl /c /Zi /W3 /WX- /diagnostics:classic /MP /Od /Ob0 /D WIN32 /D _WINDOWS /D UNICODE /D
_UNICODE /D "CMAKE_INTDIR=\"Debug\"" /D _UNICODE /D UNICODE /Gm- /RTC1 /MTd /GS /fp:precise
/Zc:wchar_t /Zc:forScope /Zc:inline /Fo"cmTC_80721.dir\Debug\" /Fd"cmTC_80721.dir\Debug\vc141.pdb"
/Gd /TC /errorReport:queue D:\DCOS\mesos\CMakeFiles\CMakeTmp\CheckIncludeFile.c

  CheckIncludeFile.c

  

D:\DCOS\mesos\CMakeFiles\CMakeTmp\CheckIncludeFile.c(1): fatal error C1083: Cannot open include
file: 'pthread.h': No such file or directory [D:\DCOS\mesos\CMakeFiles\CMakeTmp\cmTC_80721.vcxproj]

Done Building Project "D:\DCOS\mesos\CMakeFiles\CMakeTmp\cmTC_80721.vcxproj" (default targets)
-- FAILED.



Build FAILED.



"D:\DCOS\mesos\CMakeFiles\CMakeTmp\cmTC_80721.vcxproj" (default target) (1) ->

(ClCompile target) -> 

  D:\DCOS\mesos\CMakeFiles\CMakeTmp\CheckIncludeFile.c(1): fatal error C1083: Cannot open
include file: 'pthread.h': No such file or directory [D:\DCOS\mesos\CMakeFiles\CMakeTmp\cmTC_80721.vcxproj]



    0 Warning(s)

    1 Error(s)



Time Elapsed 00:00:00.61



```

- Mesos Reviewbot Windows


On Jan. 10, 2018, 9:16 a.m., Benjamin Bannier wrote:
> 
> -----------------------------------------------------------
> This is an automatically generated e-mail. To reply, visit:
> https://reviews.apache.org/r/65042/
> -----------------------------------------------------------
> 
> (Updated Jan. 10, 2018, 9:16 a.m.)
> 
> 
> Review request for mesos, Gaston Kleiman and Till Toenshoff.
> 
> 
> Repository: mesos
> 
> 
> Description
> -------
> 
> This patch adjusts the CSI example framework for recent cleanups to
> example frameworks. It now uses generic flag classes which can e.g.,
> parse from both the environment and the command line.
> 
> 
> Diffs
> -----
> 
>   src/examples/test_csi_user_framework.cpp PRE-CREATION 
> 
> 
> Diff: https://reviews.apache.org/r/65042/diff/3/
> 
> 
> Testing
> -------
> 
> `make check`
> 
> 
> Thanks,
> 
> Benjamin Bannier
> 
>


Mime
  • Unnamed multipart/alternative (inline, None, 0 bytes)
View raw message