mesos-reviews mailing list archives

Site index · List index
Message view « Date » · « Thread »
Top « Date » · « Thread »
From Mesos Reviewbot Windows <revi...@mesos.apache.org>
Subject Re: Review Request 64604: Windows: Updated heath-checks.md with Windows implementation.
Date Tue, 09 Jan 2018 02:08:42 GMT

-----------------------------------------------------------
This is an automatically generated e-mail. To reply, visit:
https://reviews.apache.org/r/64604/#review195010
-----------------------------------------------------------



FAIL: Mesos tests failed to build.

Reviews applied: `['63859', '63860', '63861', '64570', '64386', '64387', '64604']`

Failed command: `cmake.exe --build . --target mesos-tests --config Debug`

All the build artifacts available at: http://dcos-win.westus.cloudapp.azure.com/mesos-build/review/64604

Relevant logs:

- [mesos-tests-build-cmake-stdout.log](http://dcos-win.westus.cloudapp.azure.com/mesos-build/review/64604/logs/mesos-tests-build-cmake-stdout.log):

```
  D:\DCOS\mesos\mesos\src\tests\slave_tests.cpp(3301): warning C4244: 'argument': conversion
from '::size_t' to 'double', possible loss of data [D:\DCOS\mesos\src\tests\mesos-tests.vcxproj]
  D:\DCOS\mesos\mesos\src\tests\slave_tests.cpp(3323): warning C4244: 'argument': conversion
from 'double' to 'int64_t', possible loss of data [D:\DCOS\mesos\src\tests\mesos-tests.vcxproj]
  D:\DCOS\mesos\mesos\src\master/master.hpp(2094): warning C4244: 'return': conversion from
'unsigned __int64' to 'double', possible loss of data (compiling source file D:\DCOS\mesos\mesos\src\tests\slave_validation_tests.cpp)
[D:\DCOS\mesos\src\tests\mesos-tests.vcxproj]
  D:\DCOS\mesos\mesos\src\master/master.hpp(2094): warning C4244: 'return': conversion from
'unsigned __int64' to 'double', possible loss of data (compiling source file D:\DCOS\mesos\mesos\src\tests\sorter_tests.cpp)
[D:\DCOS\mesos\src\tests\mesos-tests.vcxproj]
  D:\DCOS\mesos\mesos\src\master/master.hpp(2094): warning C4244: 'return': conversion from
'unsigned __int64' to 'double', possible loss of data (compiling source file D:\DCOS\mesos\mesos\src\tests\task_status_update_manager_tests.cpp)
[D:\DCOS\mesos\src\tests\mesos-tests.vcxproj]
  D:\DCOS\mesos\mesos\src\master/master.hpp(2094): warning C4244: 'return': conversion from
'unsigned __int64' to 'double', possible loss of data (compiling source file D:\DCOS\mesos\mesos\src\tests\values_tests.cpp)
[D:\DCOS\mesos\src\tests\mesos-tests.vcxproj]
  D:\DCOS\mesos\mesos\src\tests\values_tests.cpp(51): warning C4244: 'argument': conversion
from 'double' to 'float', possible loss of data [D:\DCOS\mesos\src\tests\mesos-tests.vcxproj]
  D:\DCOS\mesos\mesos\src\tests\values_tests.cpp(51): warning C4305: 'argument': truncation
from 'double' to 'float' [D:\DCOS\mesos\src\tests\mesos-tests.vcxproj]
  D:\DCOS\mesos\mesos\src\master/master.hpp(2094): warning C4244: 'return': conversion from
'unsigned __int64' to 'double', possible loss of data (compiling source file D:\DCOS\mesos\mesos\src\tests\registrar_zookeeper_tests.cpp)
[D:\DCOS\mesos\src\tests\mesos-tests.vcxproj]
  D:\DCOS\mesos\mesos\src\master/master.hpp(2094): warning C4244: 'return': conversion from
'unsigned __int64' to 'double', possible loss of data (compiling source file D:\DCOS\mesos\mesos\src\tests\common\type_utils_tests.cpp)
[D:\DCOS\mesos\src\tests\mesos-tests.vcxproj]
  D:\DCOS\mesos\mesos\src\master/master.hpp(2094): warning C4244: 'return': conversion from
'unsigned __int64' to 'double', possible loss of data (compiling source file D:\DCOS\mesos\mesos\src\tests\containerizer\containerizer_tests.cpp)
[D:\DCOS\mesos\src\tests\mesos-tests.vcxproj]
  D:\DCOS\mesos\mesos\src\master/master.hpp(2094): warning C4244: 'return': conversion from
'unsigned __int64' to 'double', possible loss of data (compiling source file D:\DCOS\mesos\mesos\src\tests\containerizer\cpu_isolator_tests.cpp)
[D:\DCOS\mesos\src\tests\mesos-tests.vcxproj]
  D:\DCOS\mesos\mesos\src\master/master.hpp(2094): warning C4244: 'return': conversion from
'unsigned __int64' to 'double', possible loss of data (compiling source file D:\DCOS\mesos\mesos\src\tests\containerizer\memory_isolator_tests.cpp)
[D:\DCOS\mesos\src\tests\mesos-tests.vcxproj]
  D:\DCOS\mesos\mesos\src\master/master.hpp(2094): warning C4244: 'return': conversion from
'unsigned __int64' to 'double', possible loss of data (compiling source file D:\DCOS\mesos\mesos\src\tests\containerizer\docker_tests.cpp)
[D:\DCOS\mesos\src\tests\mesos-tests.vcxproj]


"D:\DCOS\mesos\src\tests\mesos-tests.vcxproj" (default target) (1) ->
(ClCompile target) -> 
  D:\DCOS\mesos\mesos\src\tests\environment.cpp(388): error C2039: 'random': is not a member
of 'mesos::UUID' [D:\DCOS\mesos\src\tests\mesos-tests.vcxproj]
  D:\DCOS\mesos\mesos\src\tests\environment.cpp(388): error C3861: 'random': identifier not
found [D:\DCOS\mesos\src\tests\mesos-tests.vcxproj]
  D:\DCOS\mesos\mesos\src\tests\environment.cpp(388): error C2228: left of '.toString' must
have class/struct/union [D:\DCOS\mesos\src\tests\mesos-tests.vcxproj]
  D:\DCOS\mesos\mesos\src\tests\environment.cpp(389): error C2039: 'random': is not a member
of 'mesos::UUID' [D:\DCOS\mesos\src\tests\mesos-tests.vcxproj]
  D:\DCOS\mesos\mesos\src\tests\environment.cpp(389): error C3861: 'random': identifier not
found [D:\DCOS\mesos\src\tests\mesos-tests.vcxproj]
  D:\DCOS\mesos\mesos\src\tests\environment.cpp(389): error C2228: left of '.toString' must
have class/struct/union [D:\DCOS\mesos\src\tests\mesos-tests.vcxproj]

    222 Warning(s)
    6 Error(s)

Time Elapsed 00:23:38.59
```

- [mesos-tests-CMakeOutput.log](http://dcos-win.westus.cloudapp.azure.com/mesos-build/review/64604/logs/mesos-tests-CMakeOutput.log):

```
  Creating directory "cmTC_f0877.dir\Debug\".

  Creating directory "D:\DCOS\mesos\CMakeFiles\CMakeTmp\Debug\".

  Creating directory "cmTC_f0877.dir\Debug\cmTC_f0877.tlog\".

InitializeBuildStatus:

  Creating "cmTC_f0877.dir\Debug\cmTC_f0877.tlog\unsuccessfulbuild" because "AlwaysCreate"
was specified.

ClCompile:

  C:\Program Files (x86)\Microsoft Visual Studio\2017\Community\VC\Tools\MSVC\14.12.25827\bin\HostX64\x64\CL.exe
/c /Zi /W3 /WX- /diagnostics:classic /Od /Ob0 /D WIN32 /D _WINDOWS /D COMPILER_SUPPORTS_CXX11
/D "CMAKE_INTDIR=\"Debug\"" /D _MBCS /Gm- /EHsc /RTC1 /MDd /GS /fp:precise /Zc:wchar_t /Zc:forScope
/Zc:inline /GR /Fo"cmTC_f0877.dir\Debug\" /Fd"cmTC_f0877.dir\Debug\vc141.pdb" /Gd /TP /errorReport:queue
D:\DCOS\mesos\CMakeFiles\CMakeTmp\src.cxx

  Microsoft (R) C/C++ Optimizing Compiler Version 19.12.25830.2 for x64

  Copyright (C) Microsoft Corporation.  All rights reserved.

  

  cl /c /Zi /W3 /WX- /diagnostics:classic /Od /Ob0 /D WIN32 /D _WINDOWS /D COMPILER_SUPPORTS_CXX11
/D "CMAKE_INTDIR=\"Debug\"" /D _MBCS /Gm- /EHsc /RTC1 /MDd /GS /fp:precise /Zc:wchar_t /Zc:forScope
/Zc:inline /GR /Fo"cmTC_f0877.dir\Debug\" /Fd"cmTC_f0877.dir\Debug\vc141.pdb" /Gd /TP /errorReport:queue
D:\DCOS\mesos\CMakeFiles\CMakeTmp\src.cxx

  src.cxx

  

Link:

  C:\Program Files (x86)\Microsoft Visual Studio\2017\Community\VC\Tools\MSVC\14.12.25827\bin\HostX64\x64\link.exe
/ERRORREPORT:QUEUE /OUT:"D:\DCOS\mesos\CMakeFiles\CMakeTmp\Debug\cmTC_f0877.exe" /INCREMENTAL
/NOLOGO kernel32.lib user32.lib gdi32.lib winspool.lib shell32.lib ole32.lib oleaut32.lib
uuid.lib comdlg32.lib advapi32.lib /MANIFEST /MANIFESTUAC:"level='asInvoker' uiAccess='false'"
/manifest:embed /DEBUG /PDB:"D:/DCOS/mesos/CMakeFiles/CMakeTmp/Debug/cmTC_f0877.pdb" /SUBSYSTEM:CONSOLE
/TLBID:1 /DYNAMICBASE /NXCOMPAT /IMPLIB:"D:/DCOS/mesos/CMakeFiles/CMakeTmp/Debug/cmTC_f0877.lib"
/MACHINE:X64  /machine:x64 cmTC_f0877.dir\Debug\src.obj

  cmTC_f0877.vcxproj -> D:\DCOS\mesos\CMakeFiles\CMakeTmp\Debug\cmTC_f0877.exe

FinalizeBuildStatus:

  Deleting file "cmTC_f0877.dir\Debug\cmTC_f0877.tlog\unsuccessfulbuild".

  Touching "cmTC_f0877.dir\Debug\cmTC_f0877.tlog\cmTC_f0877.lastbuildstate".

Done Building Project "D:\DCOS\mesos\CMakeFiles\CMakeTmp\cmTC_f0877.vcxproj" (default targets).



Build succeeded.

    0 Warning(s)

    0 Error(s)



Time Elapsed 00:00:01.25


Source file was:
int main() { return 0; }
```

- [mesos-tests-CMakeError.log](http://dcos-win.westus.cloudapp.azure.com/mesos-build/review/64604/logs/mesos-tests-CMakeError.log):

```
PrepareForBuild:

  Creating directory "cmTC_41c25.dir\Debug\".

  Creating directory "D:\DCOS\mesos\CMakeFiles\CMakeTmp\Debug\".

  Creating directory "cmTC_41c25.dir\Debug\cmTC_41c25.tlog\".

InitializeBuildStatus:

  Creating "cmTC_41c25.dir\Debug\cmTC_41c25.tlog\unsuccessfulbuild" because "AlwaysCreate"
was specified.

ClCompile:

  C:\Program Files (x86)\Microsoft Visual Studio\2017\Community\VC\Tools\MSVC\14.12.25827\bin\HostX64\x64\CL.exe
/c /Zi /W3 /WX- /diagnostics:classic /MP /Od /Ob0 /D WIN32 /D _WINDOWS /D UNICODE /D _UNICODE
/D "CMAKE_INTDIR=\"Debug\"" /D _UNICODE /D UNICODE /Gm- /RTC1 /MTd /GS /fp:precise /Zc:wchar_t
/Zc:forScope /Zc:inline /Fo"cmTC_41c25.dir\Debug\" /Fd"cmTC_41c25.dir\Debug\vc141.pdb" /Gd
/TC /errorReport:queue D:\DCOS\mesos\CMakeFiles\CMakeTmp\CheckIncludeFile.c

  Microsoft (R) C/C++ Optimizing Compiler Version 19.12.25830.2 for x64

  Copyright (C) Microsoft Corporation.  All rights reserved.

  

  cl /c /Zi /W3 /WX- /diagnostics:classic /MP /Od /Ob0 /D WIN32 /D _WINDOWS /D UNICODE /D
_UNICODE /D "CMAKE_INTDIR=\"Debug\"" /D _UNICODE /D UNICODE /Gm- /RTC1 /MTd /GS /fp:precise
/Zc:wchar_t /Zc:forScope /Zc:inline /Fo"cmTC_41c25.dir\Debug\" /Fd"cmTC_41c25.dir\Debug\vc141.pdb"
/Gd /TC /errorReport:queue D:\DCOS\mesos\CMakeFiles\CMakeTmp\CheckIncludeFile.c

  CheckIncludeFile.c

  

D:\DCOS\mesos\CMakeFiles\CMakeTmp\CheckIncludeFile.c(1): fatal error C1083: Cannot open include
file: 'pthread.h': No such file or directory [D:\DCOS\mesos\CMakeFiles\CMakeTmp\cmTC_41c25.vcxproj]

Done Building Project "D:\DCOS\mesos\CMakeFiles\CMakeTmp\cmTC_41c25.vcxproj" (default targets)
-- FAILED.



Build FAILED.



"D:\DCOS\mesos\CMakeFiles\CMakeTmp\cmTC_41c25.vcxproj" (default target) (1) ->

(ClCompile target) -> 

  D:\DCOS\mesos\CMakeFiles\CMakeTmp\CheckIncludeFile.c(1): fatal error C1083: Cannot open
include file: 'pthread.h': No such file or directory [D:\DCOS\mesos\CMakeFiles\CMakeTmp\cmTC_41c25.vcxproj]



    0 Warning(s)

    1 Error(s)



Time Elapsed 00:00:00.65



```

- Mesos Reviewbot Windows


On Jan. 5, 2018, 12:32 a.m., Akash Gupta wrote:
> 
> -----------------------------------------------------------
> This is an automatically generated e-mail. To reply, visit:
> https://reviews.apache.org/r/64604/
> -----------------------------------------------------------
> 
> (Updated Jan. 5, 2018, 12:32 a.m.)
> 
> 
> Review request for mesos, Alexander Rukletsov, Andrew Schwartzmeyer, Gaston Kleiman,
Jie Yu, and Michael Park.
> 
> 
> Repository: mesos
> 
> 
> Description
> -------
> 
> Updated health-checks.md with details of the Windows health check
> implementations for the mesos and docker executors.
> 
> 
> Diffs
> -----
> 
>   docs/health-checks.md b9b6327dea8c70dbc4aab204487a088f76c79479 
> 
> 
> Diff: https://reviews.apache.org/r/64604/diff/2/
> 
> 
> Testing
> -------
> 
> 
> Thanks,
> 
> Akash Gupta
> 
>


Mime
  • Unnamed multipart/alternative (inline, None, 0 bytes)
View raw message