mesos-reviews mailing list archives

Site index · List index
Message view « Date » · « Thread »
Top « Date » · « Thread »
From Mesos Reviewbot Windows <revi...@mesos.apache.org>
Subject Re: Review Request 64636: Fixed a bug with quota headroom that can leave reservations unallocated.
Date Fri, 15 Dec 2017 04:30:05 GMT

-----------------------------------------------------------
This is an automatically generated e-mail. To reply, visit:
https://reviews.apache.org/r/64636/#review193878
-----------------------------------------------------------



FAIL: Some Mesos tests failed.

Reviews applied: `['64636']`

Failed command: `D:\DCOS\mesos\src\mesos-tests.exe --verbose`

All the build artifacts available at: http://dcos-win.westus.cloudapp.azure.com/mesos-build/review/64636

Relevant logs:

- [mesos-tests-stdout.log](http://dcos-win.westus.cloudapp.azure.com/mesos-build/review/64636/logs/mesos-tests-stdout.log):

```

[----------] 1 test from IsolationFlag/CpuIsolatorTest
[ RUN      ] IsolationFlag/CpuIsolatorTest.ROOT_UserCpuUsage/0
[       OK ] IsolationFlag/CpuIsolatorTest.ROOT_UserCpuUsage/0 (2361 ms)
[----------] 1 test from IsolationFlag/CpuIsolatorTest (2385 ms total)

[----------] 1 test from IsolationFlag/MemoryIsolatorTest
[ RUN      ] IsolationFlag/MemoryIsolatorTest.ROOT_MemUsage/0
[       OK ] IsolationFlag/MemoryIsolatorTest.ROOT_MemUsage/0 (2341 ms)
[----------] 1 test from IsolationFlag/MemoryIsolatorTest (2364 ms total)

[----------] Global test environment tear-down
[==========] 835 tests from 85 test cases ran. (306945 ms total)
[  PASSED  ] 825 tests.
[  FAILED  ] 10 tests, listed below:
[  FAILED  ] OfferOperationStatusUpdateManagerTest.UpdateAndAckNonTerminalUpdate
[  FAILED  ] OfferOperationStatusUpdateManagerTest.RecoverCheckpointedStream
[  FAILED  ] OfferOperationStatusUpdateManagerTest.RecoverEmptyFile
[  FAILED  ] OfferOperationStatusUpdateManagerTest.RecoverTerminatedStream
[  FAILED  ] OfferOperationStatusUpdateManagerTest.IgnoreDuplicateUpdate
[  FAILED  ] OfferOperationStatusUpdateManagerTest.IgnoreDuplicateUpdateAfterRecover
[  FAILED  ] OfferOperationStatusUpdateManagerTest.RejectDuplicateAck
[  FAILED  ] OfferOperationStatusUpdateManagerTest.RejectDuplicateAckAfterRecover
[  FAILED  ] OfferOperationStatusUpdateManagerTest.NonStrictRecoveryCorruptedFile
[  FAILED  ] OfferOperationStatusUpdateManagerTest.UpdateLatestWhenResending

10 FAILED TESTS
  YOU HAVE 205 DISABLED TESTS

```

- [mesos-tests-stderr.log](http://dcos-win.westus.cloudapp.azure.com/mesos-build/review/64636/logs/mesos-tests-stderr.log):

```
I1215 04:29:40.667490  6348 executor.cpp:171] Received SUBSCRIBED event
I1215 04:29:40.672188  6348 executor.cpp:175] Subscribed executor on build-srv-03.zq4gs31qjdiunm1ryi1452nvnh.dx.internal.cloudapp.net
I1215 04:29:40.672188  6348 executor.cpp:171] Received LAUNCH event
I1215 04:29:40.675190  6348 executor.cpp:638] Starting task b76ce1a5-2123-4fd4-8bbc-bffab53732fe
I1215 04:29:40.751154  6348 executor.cpp:478] Running 'D:\DCOS\mesos\src\mesos-containerizer.exe
launch <POSSIBLY-SENSITIVE-DATA>'
I1215 04:29:41.286119  6348 executor.cpp:651] Forked command at 4192
I1215 04:29:41.312114  7032 exec.cpp:435] Executor asked to shutdown
I1215 04:29:41.313112  6028 executor.cpp:171] Received SHUTDOWN event
I1215 04:29:41.313112  6028 executor.cpp:748] Shutting down
I1215 04:29:41.313112  6028 executor.cpp:855] Sending SIGTERM to process tree at pid 4t) at
scheduler-266b8102-85ae-48a6-970f-6c1a45c96c73@10.3.1.11:57665
I1215 04:29:41.311107  3456 master.cpp:10160] Updating the state of task b76ce1a5-2123-4fd4-8bbc-bffab53732fe
of framework 0d25e8eb-a4a8-40bb-a7ca-5b775197c013-0000 (latest state: TASK_KILLED, status
update state: TASK_KILLED)
I1215 04:29:41.311107  3504 hierarchical.cpp:405] Deactivated framework 0d25e8eb-a4a8-40bb-a7ca-5b775197c013-0000
I1215 04:29:41.311107  4752 slave.cpp:3401] Shutting down framework 0d25e8eb-a4a8-40bb-a7ca-5b775197c013-0000
I1215 04:29:41.311107  4752 slave.cpp:6109] Shutting down executor 'b76ce1a5-2123-4fd4-8bbc-bffab53732fe'
of framework 0d25e8eb-a4a8-40bb-a7ca-5b775197c013-0000 at executor(1)@10.3.1.11:57688
I1215 04:29:41.312114  4752 slave.cpp:909] Agent terminating
W1215 04:29:41.312114  4752 slave.cpp:3397] Ignoring shutdown framework 0d25e8eb-a4a8-40bb-a7ca-5b775197c013-0000
because it is terminating
I1215 04:29:41.314115  3456 master.cpp:10266] Removing task b76ce1a5-2123-4fd4-8bbc-bffab53732fe
with resources cpus(allocated: *):4; mem(allocated: *):2048; disk(allocated: *):1024; ports(allocated:
*):[31000-32000] of framework 0d25e8eb-a4a8-40bb-a7ca-5b775197c013-0000 on agent 0d25e8eb-a4a8-40bb-a7ca-5b775197c013-S0
at slave(327)@10.3.1.11:57665 (build-srv-03.zq4gs31qjdiunm1ryi1452nvnh.dx.internal.cloudapp.net)
I1215 04:29:41.315110  4752 containerizer.cpp:2337] Destroying container afd4f92e-bc93-480e-a61f-d41d005968a8
in RUNNING state
I1215 04:29:41.316121  4752 containerizer.cpp:2939] Transitioning the state of container afd4f92e-bc93-480e-a61f-d41d005968a8
from RUNNING to DESTROYING
I1215 04:29:41.316121  4752 launcher.cpp:156] Asked to destroy container afd4f92e-bc93-480e-a61f-d41d005968a8
I1215 04:29:41.317127  3456 master.cpp:1305] Agent 0d25e8eb-a4a8-40bb-a7ca-5b775197c013-S0
at slave(327)@10.3.1.11:57665 (build-srv-03.zq4gs31qjdiunm1ryi1452nvnh.dx.internal.cloudapp.net)
disconnected
I1215 04:29:41.317127  3456 master.cpp:3364] Disconnecting agent 0d25e8eb-a4a8-40bb-a7ca-5b775197c013-S0
at slave(327)@10.3.1.11:57665 (build-srv-03.zq4gs31qjdiunm1ryi1452nvnh.dx.internal.cloudapp.net)
I1215 04:29:41.317127  3768 hierarchical.cpp:344] Removed framework 0d25e8eb-a4a8-40bb-a7ca-5b775197c013-0000
I1215 04:29:41.317127  3456 master.cpp:3383] Deactivating agent 0d25e8eb-a4a8-40bb-a7ca-5b775197c013-S0
at slave(327)@10.3.1.11:57665 (build-srv-03.zq4gs31qjdiunm1ryi1452nvnh.dx.internal.cloudapp.net)
I1215 04:29:41.318111  6396 hierarchical.cpp:766] Agent 0d25e8eb-a4a8-40bb-a7ca-5b775197c013-S0
deactivated
I1215 04:29:41.353188  3768 containerizer.cpp:2788] Container afd4f92e-bc93-480e-a61f-d41d005968a8
has exited
I1215 04:29:41.382117  2760 master.cpp:1147] Master terminating
I1215 04:29:41.384119  6356 hierarchical.cpp:609] Removed agent 0d25e8eb-a4a8-40bb-a7ca-5b775197c013-S0
I1215 04:29:41.628448  2668 process.cpp:887] Failed to accept socket: future discarded
```

- Mesos Reviewbot Windows


On Dec. 15, 2017, 2:34 a.m., Meng Zhu wrote:
> 
> -----------------------------------------------------------
> This is an automatically generated e-mail. To reply, visit:
> https://reviews.apache.org/r/64636/
> -----------------------------------------------------------
> 
> (Updated Dec. 15, 2017, 2:34 a.m.)
> 
> 
> Review request for mesos and Benjamin Mahler.
> 
> 
> Bugs: MESOS-8293
>     https://issues.apache.org/jira/browse/MESOS-8293
> 
> 
> Repository: mesos
> 
> 
> Description
> -------
> 
> Also fixed a bug where quota headroom may wrongly include revocable
> resources.
> 
> 
> Diffs
> -----
> 
>   src/master/allocator/mesos/hierarchical.cpp fccd71c96fe8e4d914e19b5ea8d8f69e9ebf2406

> 
> 
> Diff: https://reviews.apache.org/r/64636/diff/2/
> 
> 
> Testing
> -------
> 
> make check.
> 
> 
> Thanks,
> 
> Meng Zhu
> 
>


Mime
  • Unnamed multipart/alternative (inline, None, 0 bytes)
View raw message