mesos-reviews mailing list archives

Site index · List index
Message view « Date » · « Thread »
Top « Date » · « Thread »
From Mesos Reviewbot Windows <revi...@mesos.apache.org>
Subject Re: Review Request 64633: Disabled checkpointing for OFFER_OPERATION_DROPPED in SLRP.
Date Fri, 15 Dec 2017 03:33:53 GMT

-----------------------------------------------------------
This is an automatically generated e-mail. To reply, visit:
https://reviews.apache.org/r/64633/#review193875
-----------------------------------------------------------



FAIL: Some Mesos tests failed.

Reviews applied: `['64627', '64633']`

Failed command: `D:\DCOS\mesos\src\mesos-tests.exe --verbose`

All the build artifacts available at: http://dcos-win.westus.cloudapp.azure.com/mesos-build/review/64633

Relevant logs:

- [mesos-tests-stdout.log](http://dcos-win.westus.cloudapp.azure.com/mesos-build/review/64633/logs/mesos-tests-stdout.log):

```

[----------] 1 test from IsolationFlag/CpuIsolatorTest
[ RUN      ] IsolationFlag/CpuIsolatorTest.ROOT_UserCpuUsage/0
[       OK ] IsolationFlag/CpuIsolatorTest.ROOT_UserCpuUsage/0 (2272 ms)
[----------] 1 test from IsolationFlag/CpuIsolatorTest (2297 ms total)

[----------] 1 test from IsolationFlag/MemoryIsolatorTest
[ RUN      ] IsolationFlag/MemoryIsolatorTest.ROOT_MemUsage/0
[       OK ] IsolationFlag/MemoryIsolatorTest.ROOT_MemUsage/0 (2359 ms)
[----------] 1 test from IsolationFlag/MemoryIsolatorTest (2381 ms total)

[----------] Global test environment tear-down
[==========] 835 tests from 85 test cases ran. (310019 ms total)
[  PASSED  ] 825 tests.
[  FAILED  ] 10 tests, listed below:
[  FAILED  ] OfferOperationStatusUpdateManagerTest.UpdateAndAckNonTerminalUpdate
[  FAILED  ] OfferOperationStatusUpdateManagerTest.RecoverCheckpointedStream
[  FAILED  ] OfferOperationStatusUpdateManagerTest.RecoverEmptyFile
[  FAILED  ] OfferOperationStatusUpdateManagerTest.RecoverTerminatedStream
[  FAILED  ] OfferOperationStatusUpdateManagerTest.IgnoreDuplicateUpdate
[  FAILED  ] OfferOperationStatusUpdateManagerTest.IgnoreDuplicateUpdateAfterRecover
[  FAILED  ] OfferOperationStatusUpdateManagerTest.RejectDuplicateAck
[  FAILED  ] OfferOperationStatusUpdateManagerTest.RejectDuplicateAckAfterRecover
[  FAILED  ] OfferOperationStatusUpdateManagerTest.NonStrictRecoveryCorruptedFile
[  FAILED  ] OfferOperationStatusUpdateManagerTest.UpdateLatestWhenResending

10 FAILED TESTS
  YOU HAVE 205 DISABLED TESTS

```

- [mesos-tests-stderr.log](http://dcos-win.westus.cloudapp.azure.com/mesos-build/review/64633/logs/mesos-tests-stderr.log):

```
I1215 03:33:29.995703  4716 master.cpp:10160] Updating the state of task 8e2c5d90-b9b7-4667-a87e-61bd8dd3a411
of framework f0405c66-a112-4530-b46d-b01dcf1a48d6-0000 (latest state: TASK_KILLED, status
update state: TASK_KILLED)
I1215 03:33:29.995703  2956 slave.cpp:3401] Shutting down framework f0405c66-a112-4530-b46d-b01dcf1a48d6-0000
I1215 03:33:29.996701  2956 slave.cpp:6109] Shutting down executor '8e2c5d90-b9b7-4667-a87e-61bd8dd3a411'
of framework f0405c66-a112-4530-b46d-b01dcf1a48d6-0000 at executor(1)@10.3.1.11:55704
I1215 03:33:29.997701  2956 slave.cpp:909] Agent terminating
W1215 03:33:29.997701  2956 slave.cpp:3397] Ignoring shutdown framework f0405c66-a112-4530-b46d-b01dcf1a48d6-0000
because it is terminating
I1215 03:33:29.998702  4716 master.cpp:10266] Removing task 8e2c5d90-b9b7-4667-a87e-61bd8dd3a411
with resources cpus(allocated: *):4; mem(allocated: *):2048; disk(allocated: *):1024; ports(allocated:
*):[31000-32000] oI1215 03:33:29.341761   956 exec.cpp:162] Version: 1.5.0
I1215 03:33:29.365736  4884 exec.cpp:237] Executor registered on agent f0405c66-a112-4530-b46d-b01dcf1a48d6-S0
I1215 03:33:29.368733  3400 executor.cpp:171] Received SUBSCRIBED event
I1215 03:33:29.372761  3400 executor.cpp:175] Subscribed executor on build-srv-03.zq4gs31qjdiunm1ryi1452nvnh.dx.internal.cloudapp.net
I1215 03:33:29.373760  3400 executor.cpp:171] Received LAUNCH event
I1215 03:33:29.377763  3400 executor.cpp:638] Starting task 8e2c5d90-b9b7-4667-a87e-61bd8dd3a411
I1215 03:33:29.453752  3400 executor.cpp:478] Running 'D:\DCOS\mesos\src\mesos-containerizer.exe
launch <POSSIBLY-SENSITIVE-DATA>'
I1215 03:33:29.970703  3400 executor.cpp:651] Forked command at 2940
I1215 03:33:29.998702  1176 exec.cpp:435] Executor asked to shutdown
I1215 03:33:29.998702  5344 executor.cpp:171] Received SHUTDOWN event
I1215 03:33:29.998702  5344 executor.cpp:748] Shutting down
I1215 03:33:29.998702  5344 executor.cpp:855] Sending SIGTERM to process tree at pid 2f framework
f0405c66-a112-4530-b46d-b01dcf1a48d6-0000 on agent f0405c66-a112-4530-b46d-b01dcf1a48d6-S0
at slave(327)@10.3.1.11:55683 (build-srv-03.zq4gs31qjdiunm1ryi1452nvnh.dx.internal.cloudapp.net)
I1215 03:33:30.000700   876 containerizer.cpp:2337] Destroying container 290e0269-a546-4620-b36f-49568abe772b
in RUNNING state
I1215 03:33:30.000700   876 containerizer.cpp:2939] Transitioning the state of container 290e0269-a546-4620-b36f-49568abe772b
from RUNNING to DESTROYING
I1215 03:33:30.000700  4716 master.cpp:1305] Agent f0405c66-a112-4530-b46d-b01dcf1a48d6-S0
at slave(327)@10.3.1.11:55683 (build-srv-03.zq4gs31qjdiunm1ryi1452nvnh.dx.internal.cloudapp.net)
disconnected
I1215 03:33:30.001700  4716 master.cpp:3364] Disconnecting agent f0405c66-a112-4530-b46d-b01dcf1a48d6-S0
at slave(327)@10.3.1.11:55683 (build-srv-03.zq4gs31qjdiunm1ryi1452nvnh.dx.internal.cloudapp.net)
I1215 03:33:30.001700  4716 master.cpp:3383] Deactivating agent f0405c66-a112-4530-b46d-b01dcf1a48d6-S0
at slave(327)@10.3.1.11:55683 (build-srv-03.zq4gs31qjdiunm1ryi1452nvnh.dx.internal.cloudapp.net)
I1215 03:33:30.001700   876 launcher.cpp:156] Asked to destroy container 290e0269-a546-4620-b36f-49568abe772b
I1215 03:33:30.001700  5680 hierarchical.cpp:344] Removed framework f0405c66-a112-4530-b46d-b01dcf1a48d6-0000
I1215 03:33:30.001700  5680 hierarchical.cpp:766] Agent f0405c66-a112-4530-b46d-b01dcf1a48d6-S0
deactivated
I1215 03:33:30.072834  4716 containerizer.cpp:2788] Container 290e0269-a546-4620-b36f-49568abe772b
has exited
I1215 03:33:30.101907  4640 master.cpp:1147] Master terminating
I1215 03:33:30.103900  5064 hierarchical.cpp:609] Removed agent f0405c66-a112-4530-b46d-b01dcf1a48d6-S0
I1215 03:33:30.334899  6716 process.cpp:887] Failed to accept socket: future discarded
```

- Mesos Reviewbot Windows


On Dec. 15, 2017, 1:02 a.m., Chun-Hung Hsiao wrote:
> 
> -----------------------------------------------------------
> This is an automatically generated e-mail. To reply, visit:
> https://reviews.apache.org/r/64633/
> -----------------------------------------------------------
> 
> (Updated Dec. 15, 2017, 1:02 a.m.)
> 
> 
> Review request for mesos, Gaston Kleiman, Greg Mann, and Jie Yu.
> 
> 
> Repository: mesos
> 
> 
> Description
> -------
> 
> Disabled checkpointing for OFFER_OPERATION_DROPPED in SLRP.
> 
> 
> Diffs
> -----
> 
>   src/resource_provider/storage/provider.cpp 17acf1b430b81e31bd97b117a44477eebab7e6f4

> 
> 
> Diff: https://reviews.apache.org/r/64633/diff/1/
> 
> 
> Testing
> -------
> 
> sudo make check
> 
> 
> Thanks,
> 
> Chun-Hung Hsiao
> 
>


Mime
  • Unnamed multipart/alternative (inline, None, 0 bytes)
View raw message