mesos-reviews mailing list archives

Site index · List index
Message view « Date » · « Thread »
Top « Date » · « Thread »
From Mesos Reviewbot Windows <revi...@mesos.apache.org>
Subject Re: Review Request 64628: Updated GET_CONTAINERS API allowing nested/standalone containers.
Date Fri, 15 Dec 2017 01:52:38 GMT

-----------------------------------------------------------
This is an automatically generated e-mail. To reply, visit:
https://reviews.apache.org/r/64628/#review193868
-----------------------------------------------------------



FAIL: Some Mesos tests failed.

Reviews applied: `['64623', '64624', '64628']`

Failed command: `D:\DCOS\mesos\src\mesos-tests.exe --verbose`

All the build artifacts available at: http://dcos-win.westus.cloudapp.azure.com/mesos-build/review/64628

Relevant logs:

- [mesos-tests-stdout.log](http://dcos-win.westus.cloudapp.azure.com/mesos-build/review/64628/logs/mesos-tests-stdout.log):

```

[----------] 1 test from IsolationFlag/CpuIsolatorTest
[ RUN      ] IsolationFlag/CpuIsolatorTest.ROOT_UserCpuUsage/0
[       OK ] IsolationFlag/CpuIsolatorTest.ROOT_UserCpuUsage/0 (2366 ms)
[----------] 1 test from IsolationFlag/CpuIsolatorTest (2391 ms total)

[----------] 1 test from IsolationFlag/MemoryIsolatorTest
[ RUN      ] IsolationFlag/MemoryIsolatorTest.ROOT_MemUsage/0
[       OK ] IsolationFlag/MemoryIsolatorTest.ROOT_MemUsage/0 (2375 ms)
[----------] 1 test from IsolationFlag/MemoryIsolatorTest (2399 ms total)

[----------] Global test environment tear-down
[==========] 835 tests from 85 test cases ran. (310957 ms total)
[  PASSED  ] 825 tests.
[  FAILED  ] 10 tests, listed below:
[  FAILED  ] OfferOperationStatusUpdateManagerTest.UpdateAndAckNonTerminalUpdate
[  FAILED  ] OfferOperationStatusUpdateManagerTest.RecoverCheckpointedStream
[  FAILED  ] OfferOperationStatusUpdateManagerTest.RecoverEmptyFile
[  FAILED  ] OfferOperationStatusUpdateManagerTest.RecoverTerminatedStream
[  FAILED  ] OfferOperationStatusUpdateManagerTest.IgnoreDuplicateUpdate
[  FAILED  ] OfferOperationStatusUpdateManagerTest.IgnoreDuplicateUpdateAfterRecover
[  FAILED  ] OfferOperationStatusUpdateManagerTest.RejectDuplicateAck
[  FAILED  ] OfferOperationStatusUpdateManagerTest.RejectDuplicateAckAfterRecover
[  FAILED  ] OfferOperationStatusUpdateManagerTest.NonStrictRecoveryCorruptedFile
[  FAILED  ] OfferOperationStatusUpdateManagerTest.UpdateLatestWhenResending

10 FAILED TESTS
  YOU HAVE 205 DISABLED TESTS

```

- [mesos-tests-stderr.log](http://dcos-win.westus.cloudapp.azure.com/mesos-build/review/64628/logs/mesos-tests-stderr.log):

```
I1215 01:52:14.036015  5996 executor.cpp:171] Received SUBSCRIBED event
I1215 01:52:14.040041  5996 executor.cpp:175] Subscribed executor on build-srv-03.zq4gs31qjdiunm1ryi1452nvnh.dx.internal.cloudapp.net
I1215 01:52:14.040041  5996 executor.cpp:171] Received LAUNCH event
I1215 01:52:14.043992  5996 executor.cpp:638] Starting task eff83a3b-a0d6-4e96-89ab-42b3f6614ad2
I1215 01:52:14.118011  5996 executor.cpp:478] Running 'D:\DCOS\mesos\src\mesos-containerizer.exe
launch <POSSIBLY-SENSITIVE-DATA>'
I1215 01:52:14.655971  5996 executor.cpp:651] Forked command at 5156
I1215 01:52:14.682143  4228 exec.cpp:435] Executor asked to shutdown
I1215 01:52:14.682143  5840 executor.cpp:171] Received SHUTDOWN event
I1215 01:52:14.682143  5840 executor.cpp:748] Shutting down
I1215 01:52:14.682143  5840 executor.cpp:855] Sending SIGTERM to process tree at pid 5-0000
(default) at scheduler-2431f80f-55bc-4130-82a2-888abb058455@10.3.1.11:53244
I1215 01:52:14.679976  1564 hierarchical.cpp:405] Deactivated framework 1e12efa3-d813-458f-a65f-6cbe4ecc5ca9-0000
I1215 01:52:14.679976  5036 master.cpp:10160] Updating the state of task eff83a3b-a0d6-4e96-89ab-42b3f6614ad2
of framework 1e12efa3-d813-458f-a65f-6cbe4ecc5ca9-0000 (latest state: TASK_KILLED, status
update state: TASK_KILLED)
I1215 01:52:14.679976  5436 slave.cpp:3401] Shutting down framework 1e12efa3-d813-458f-a65f-6cbe4ecc5ca9-0000
I1215 01:52:14.679976  5436 slave.cpp:6109] Shutting down executor 'eff83a3b-a0d6-4e96-89ab-42b3f6614ad2'
of framework 1e12efa3-d813-458f-a65f-6cbe4ecc5ca9-0000 at executor(1)@10.3.1.11:53265
I1215 01:52:14.680979  5436 slave.cpp:909] Agent terminating
W1215 01:52:14.680979  5436 slave.cpp:3397] Ignoring shutdown framework 1e12efa3-d813-458f-a65f-6cbe4ecc5ca9-0000
because it is terminating
I1215 01:52:14.682143  5036 master.cpp:10266] Removing task eff83a3b-a0d6-4e96-89ab-42b3f6614ad2
with resources cpus(allocated: *):4; mem(allocated: *):2048; disk(allocated: *):1024; ports(allocated:
*):[31000-32000] of framework 1e12efa3-d813-458f-a65f-6cbe4ecc5ca9-0000 on agent 1e12efa3-d813-458f-a65f-6cbe4ecc5ca9-S0
at slave(327)@10.3.1.11:53244 (build-srv-03.zq4gs31qjdiunm1ryi1452nvnh.dx.internal.cloudapp.net)
I1215 01:52:14.684957  1564 containerizer.cpp:2356] Destroying container 4e0dee01-d306-4368-883f-caaed749bec9
in RUNNING state
I1215 01:52:14.684957  1564 containerizer.cpp:2959] Transitioning the state of container 4e0dee01-d306-4368-883f-caaed749bec9
from RUNNING to DESTROYING
I1215 01:52:14.684957  5036 master.cpp:1305] Agent 1e12efa3-d813-458f-a65f-6cbe4ecc5ca9-S0
at slave(327)@10.3.1.11:53244 (build-srv-03.zq4gs31qjdiunm1ryi1452nvnh.dx.internal.cloudapp.net)
disconnected
I1215 01:52:14.684957  5036 master.cpp:3364] Disconnecting agent 1e12efa3-d813-458f-a65f-6cbe4ecc5ca9-S0
at slave(327)@10.3.1.11:53244 (build-srv-03.zq4gs31qjdiunm1ryi1452nvnh.dx.internal.cloudapp.net)
I1215 01:52:14.684957  5036 master.cpp:3383] Deactivating agent 1e12efa3-d813-458f-a65f-6cbe4ecc5ca9-S0
at slave(327)@10.3.1.11:53244 (build-srv-03.zq4gs31qjdiunm1ryi1452nvnh.dx.internal.cloudapp.net)
I1215 01:52:14.685972  6940 hierarchical.cpp:344] Removed framework 1e12efa3-d813-458f-a65f-6cbe4ecc5ca9-0000
I1215 01:52:14.685972  1564 launcher.cpp:156] Asked to destroy container 4e0dee01-d306-4368-883f-caaed749bec9
I1215 01:52:14.685972  6940 hierarchical.cpp:766] Agent 1e12efa3-d813-458f-a65f-6cbe4ecc5ca9-S0
deactivated
I1215 01:52:14.749060  5036 containerizer.cpp:2807] Container 4e0dee01-d306-4368-883f-caaed749bec9
has exited
I1215 01:52:14.779068  6340 master.cpp:1147] Master terminating
I1215 01:52:14.781065  1564 hierarchical.cpp:609] Removed agent 1e12efa3-d813-458f-a65f-6cbe4ecc5ca9-S0
I1215 01:52:15.021055  5624 process.cpp:887] Failed to accept socket: future discarded
```

- Mesos Reviewbot Windows


On Dec. 14, 2017, 11:07 p.m., Jie Yu wrote:
> 
> -----------------------------------------------------------
> This is an automatically generated e-mail. To reply, visit:
> https://reviews.apache.org/r/64628/
> -----------------------------------------------------------
> 
> (Updated Dec. 14, 2017, 11:07 p.m.)
> 
> 
> Review request for mesos, Gilbert Song and Vinod Kone.
> 
> 
> Bugs: MESOS-8040
>     https://issues.apache.org/jira/browse/MESOS-8040
> 
> 
> Repository: mesos
> 
> 
> Description
> -------
> 
> Updated GET_CONTAINERS API allowing nested/standalone containers.
> 
> 
> Diffs
> -----
> 
>   include/mesos/agent/agent.proto c3b1f22b7e414d83d405d7d1a3b38b6fbfbfab79 
>   include/mesos/v1/agent/agent.proto 280a3b0975ec20a6a6fc2407e47a40ce4574fc9c 
> 
> 
> Diff: https://reviews.apache.org/r/64628/diff/1/
> 
> 
> Testing
> -------
> 
> n/a
> 
> 
> Thanks,
> 
> Jie Yu
> 
>


Mime
  • Unnamed multipart/alternative (inline, None, 0 bytes)
View raw message