mesos-reviews mailing list archives

Site index · List index
Message view « Date » · « Thread »
Top « Date » · « Thread »
From Mesos Reviewbot Windows <revi...@mesos.apache.org>
Subject Re: Review Request 61172: Added mesos.http and mesos.exceptions for CLI.
Date Fri, 15 Dec 2017 00:54:59 GMT

-----------------------------------------------------------
This is an automatically generated e-mail. To reply, visit:
https://reviews.apache.org/r/61172/#review193865
-----------------------------------------------------------



FAIL: Some Mesos tests failed.

Reviews applied: `['61172']`

Failed command: `D:\DCOS\mesos\src\mesos-tests.exe --verbose`

All the build artifacts available at: http://dcos-win.westus.cloudapp.azure.com/mesos-build/review/61172

Relevant logs:

- [mesos-tests-stdout.log](http://dcos-win.westus.cloudapp.azure.com/mesos-build/review/61172/logs/mesos-tests-stdout.log):

```

[----------] 1 test from IsolationFlag/CpuIsolatorTest
[ RUN      ] IsolationFlag/CpuIsolatorTest.ROOT_UserCpuUsage/0
[       OK ] IsolationFlag/CpuIsolatorTest.ROOT_UserCpuUsage/0 (2300 ms)
[----------] 1 test from IsolationFlag/CpuIsolatorTest (2321 ms total)

[----------] 1 test from IsolationFlag/MemoryIsolatorTest
[ RUN      ] IsolationFlag/MemoryIsolatorTest.ROOT_MemUsage/0
[       OK ] IsolationFlag/MemoryIsolatorTest.ROOT_MemUsage/0 (2360 ms)
[----------] 1 test from IsolationFlag/MemoryIsolatorTest (2381 ms total)

[----------] Global test environment tear-down
[==========] 835 tests from 85 test cases ran. (299416 ms total)
[  PASSED  ] 825 tests.
[  FAILED  ] 10 tests, listed below:
[  FAILED  ] OfferOperationStatusUpdateManagerTest.UpdateAndAckNonTerminalUpdate
[  FAILED  ] OfferOperationStatusUpdateManagerTest.RecoverCheckpointedStream
[  FAILED  ] OfferOperationStatusUpdateManagerTest.RecoverEmptyFile
[  FAILED  ] OfferOperationStatusUpdateManagerTest.RecoverTerminatedStream
[  FAILED  ] OfferOperationStatusUpdateManagerTest.IgnoreDuplicateUpdate
[  FAILED  ] OfferOperationStatusUpdateManagerTest.IgnoreDuplicateUpdateAfterRecover
[  FAILED  ] OfferOperationStatusUpdateManagerTest.RejectDuplicateAck
[  FAILED  ] OfferOperationStatusUpdateManagerTest.RejectDuplicateAckAfterRecover
[  FAILED  ] OfferOperationStatusUpdateManagerTest.NonStrictRecoveryCorruptedFile
[  FAILED  ] OfferOperationStatusUpdateManagerTest.UpdateLatestWhenResending

10 FAILED TESTS
  YOU HAVE 205 DISABLED TESTS

```

- [mesos-tests-stderr.log](http://dcos-win.westus.cloudapp.azure.com/mesos-build/review/61172/logs/mesos-tests-stderr.log):

```
I1215 00:54:40.913776  4288 executor.cpp:171] Received SUBSCRIBED event
I1215 00:54:40.917809  4288 executor.cpp:175] Subscribed executor on build-srv-04.zq4gs31qjdiunm1ryi1452nvnh.dx.internal.cloudapp.net
I1215 00:54:40.917809  4288 executor.cpp:171] Received LAUNCH event
I1215 00:54:40.921775  4288 executor.cpp:638] Starting task 0662bbfd-d2a8-4c5d-a66c-f03db05a338c
I1215 00:54:41.002766  4288 executor.cpp:478] Running 'D:\DCOS\mesos\src\mesos-containerizer.exe
launch <POSSIBLY-SENSITIVE-DATA>'
I1215 00:54:41.522768  4288 executor.cpp:651] Forked command at 7960
I1215 00:54:41.549741  3068 exec.cpp:435] Executor asked to shutdown
I1215 00:54:41.550741  6000 executor.cpp:171] Received SHUTDOWN event
I1215 00:54:41.550741  6000 executor.cpp:748] Shutting down
I1215 00:54:41.550741  6000 executor.cpp:855] Sending SIGTERM to process tree at pid 7f1d-620f715674fc@10.3.1.5:55494
I1215 00:54:41.548761  3324 hierarchical.cpp:405] Deactivated framework 2bd92c1d-99e0-4d10-bd5b-6f3e1ed566ec-0000
I1215 00:54:41.548761  6532 master.cpp:10160] Updating the state of task 0662bbfd-d2a8-4c5d-a66c-f03db05a338c
of framework 2bd92c1d-99e0-4d10-bd5b-6f3e1ed566ec-0000 (latest state: TASK_KILLED, status
update state: TASK_KILLED)
I1215 00:54:41.548761  4976 slave.cpp:3401] Shutting down framework 2bd92c1d-99e0-4d10-bd5b-6f3e1ed566ec-0000
I1215 00:54:41.548761  4976 slave.cpp:6109] Shutting down executor '0662bbfd-d2a8-4c5d-a66c-f03db05a338c'
of framework 2bd92c1d-99e0-4d10-bd5b-6f3e1ed566ec-0000 at executor(1)@10.3.1.5:55515
I1215 00:54:41.549741  4976 slave.cpp:909] Agent terminating
W1215 00:54:41.549741  4976 slave.cpp:3397] Ignoring shutdown framework 2bd92c1d-99e0-4d10-bd5b-6f3e1ed566ec-0000
because it is terminating
I1215 00:54:41.550741  6532 master.cpp:10266] Removing task 0662bbfd-d2a8-4c5d-a66c-f03db05a338c
with resources cpus(allocated: *):4; mem(allocated: *):2048; disk(allocated: *):1024; ports(allocated:
*):[31000-32000] of framework 2bd92c1d-99e0-4d10-bd5b-6f3e1ed566ec-0000 on agent 2bd92c1d-99e0-4d10-bd5b-6f3e1ed566ec-S0
at slave(327)@10.3.1.5:55494 (build-srv-04.zq4gs31qjdiunm1ryi1452nvnh.dx.internal.cloudapp.net)
I1215 00:54:41.552742  3324 containerizer.cpp:2337] Destroying container 265f8346-5ca3-4a3e-a170-6fc4179b8f8c
in RUNNING state
I1215 00:54:41.552742  3324 containerizer.cpp:2939] Transitioning the state of container 265f8346-5ca3-4a3e-a170-6fc4179b8f8c
from RUNNING to DESTROYING
I1215 00:54:41.553786  3324 launcher.cpp:156] Asked to destroy container 265f8346-5ca3-4a3e-a170-6fc4179b8f8c
I1215 00:54:41.554741  6532 master.cpp:1305] Agent 2bd92c1d-99e0-4d10-bd5b-6f3e1ed566ec-S0
at slave(327)@10.3.1.5:55494 (build-srv-04.zq4gs31qjdiunm1ryi1452nvnh.dx.internal.cloudapp.net)
disconnected
I1215 00:54:41.554741  6532 master.cpp:3364] Disconnecting agent 2bd92c1d-99e0-4d10-bd5b-6f3e1ed566ec-S0
at slave(327)@10.3.1.5:55494 (build-srv-04.zq4gs31qjdiunm1ryi1452nvnh.dx.internal.cloudapp.net)
I1215 00:54:41.554741  5304 hierarchical.cpp:344] Removed framework 2bd92c1d-99e0-4d10-bd5b-6f3e1ed566ec-0000
I1215 00:54:41.555742  6532 master.cpp:3383] Deactivating agent 2bd92c1d-99e0-4d10-bd5b-6f3e1ed566ec-S0
at slave(327)@10.3.1.5:55494 (build-srv-04.zq4gs31qjdiunm1ryi1452nvnh.dx.internal.cloudapp.net)
I1215 00:54:41.555742  2020 hierarchical.cpp:766] Agent 2bd92c1d-99e0-4d10-bd5b-6f3e1ed566ec-S0
deactivated
I1215 00:54:41.655813  5304 containerizer.cpp:2788] Container 265f8346-5ca3-4a3e-a170-6fc4179b8f8c
has exited
I1215 00:54:41.683852  6620 master.cpp:1147] Master terminating
I1215 00:54:41.685817  5304 hierarchical.cpp:609] Removed agent 2bd92c1d-99e0-4d10-bd5b-6f3e1ed566ec-S0
I1215 00:54:42.003293  4012 process.cpp:887] Failed to accept socket: future discarded
```

- Mesos Reviewbot Windows


On Nov. 30, 2017, 10:16 a.m., Eric Chung wrote:
> 
> -----------------------------------------------------------
> This is an automatically generated e-mail. To reply, visit:
> https://reviews.apache.org/r/61172/
> -----------------------------------------------------------
> 
> (Updated Nov. 30, 2017, 10:16 a.m.)
> 
> 
> Review request for mesos, Armand Grillet, Jason Lai, and Kevin Klues.
> 
> 
> Repository: mesos
> 
> 
> Description
> -------
> 
> Part of MESOS-7310, this patch adds the mesos.http and mesos.exceptions
> modules, which provides a Resource class and its descendants for
> abstracting away common operations over http connectioins with JSON
> serialization.
> 
> updated patch according to klueska's recommendations
> 
> 
> Diffs
> -----
> 
>   src/python/cli_new/bootstrap c84e549e59bc7a07b5b70c24c63bc0c16881e442 
>   src/python/lib/mesos/exceptions.py PRE-CREATION 
>   src/python/lib/mesos/http.py PRE-CREATION 
>   src/python/lib/requirements.in e69de29bb2d1d6434b8b29ae775ad8c2e48c5391 
>   src/python/lib/tests/conftest.py PRE-CREATION 
>   src/python/lib/tests/test_exceptions.py PRE-CREATION 
>   src/python/lib/tests/test_http.py PRE-CREATION 
>   src/python/lib/tox.ini 8ad030d2dbf1fb7a04f1eaadb587462b4ef3f054 
>   support/pylint.config f74f553e238553bd6a6c06f4dd888cc5954a33eb 
> 
> 
> Diff: https://reviews.apache.org/r/61172/diff/7/
> 
> 
> Testing
> -------
> 
> install tox
> cd src/python/lib
> tox
> 
> 
> Thanks,
> 
> Eric Chung
> 
>


Mime
  • Unnamed multipart/alternative (inline, None, 0 bytes)
View raw message