mesos-reviews mailing list archives

Site index · List index
Message view « Date » · « Thread »
Top « Date » · « Thread »
From Mesos Reviewbot Windows <revi...@mesos.apache.org>
Subject Re: Review Request 64590: Stopped logging optional fields unconditionally in agent handler.
Date Fri, 15 Dec 2017 00:07:39 GMT

-----------------------------------------------------------
This is an automatically generated e-mail. To reply, visit:
https://reviews.apache.org/r/64590/#review193862
-----------------------------------------------------------



FAIL: Some Mesos tests failed.

Reviews applied: `['64590']`

Failed command: `D:\DCOS\mesos\src\mesos-tests.exe --verbose`

All the build artifacts available at: http://dcos-win.westus.cloudapp.azure.com/mesos-build/review/64590

Relevant logs:

- [mesos-tests-stdout.log](http://dcos-win.westus.cloudapp.azure.com/mesos-build/review/64590/logs/mesos-tests-stdout.log):

```

[----------] 1 test from IsolationFlag/CpuIsolatorTest
[ RUN      ] IsolationFlag/CpuIsolatorTest.ROOT_UserCpuUsage/0
[       OK ] IsolationFlag/CpuIsolatorTest.ROOT_UserCpuUsage/0 (2304 ms)
[----------] 1 test from IsolationFlag/CpuIsolatorTest (2326 ms total)

[----------] 1 test from IsolationFlag/MemoryIsolatorTest
[ RUN      ] IsolationFlag/MemoryIsolatorTest.ROOT_MemUsage/0
[       OK ] IsolationFlag/MemoryIsolatorTest.ROOT_MemUsage/0 (2239 ms)
[----------] 1 test from IsolationFlag/MemoryIsolatorTest (2261 ms total)

[----------] Global test environment tear-down
[==========] 835 tests from 85 test cases ran. (308347 ms total)
[  PASSED  ] 825 tests.
[  FAILED  ] 10 tests, listed below:
[  FAILED  ] OfferOperationStatusUpdateManagerTest.UpdateAndAckNonTerminalUpdate
[  FAILED  ] OfferOperationStatusUpdateManagerTest.RecoverCheckpointedStream
[  FAILED  ] OfferOperationStatusUpdateManagerTest.RecoverEmptyFile
[  FAILED  ] OfferOperationStatusUpdateManagerTest.RecoverTerminatedStream
[  FAILED  ] OfferOperationStatusUpdateManagerTest.IgnoreDuplicateUpdate
[  FAILED  ] OfferOperationStatusUpdateManagerTest.IgnoreDuplicateUpdateAfterRecover
[  FAILED  ] OfferOperationStatusUpdateManagerTest.RejectDuplicateAck
[  FAILED  ] OfferOperationStatusUpdateManagerTest.RejectDuplicateAckAfterRecover
[  FAILED  ] OfferOperationStatusUpdateManagerTest.NonStrictRecoveryCorruptedFile
[  FAILED  ] OfferOperationStatusUpdateManagerTest.UpdateLatestWhenResending

10 FAILED TESTS
  YOU HAVE 205 DISABLED TESTS

```

- [mesos-tests-stderr.log](http://dcos-win.westus.cloudapp.azure.com/mesos-build/review/64590/logs/mesos-tests-stderr.log):

```
I1215 00:07:20.418342  4992 slave.cpp:3401] Shutting down framework c8e4e0c9-cc00-404f-b6ec-a81d26b237d4-0000
I1215 00:07:20.418342  1716 master.cpp:10160] Updating the state of task c82b6c1c-acfd-4f82-a0da-3322d9ab5be1
of framework c8e4e0c9-cc00-40I1215 00:07:19.761358  7208 exec.cpp:162] Version: 1.5.0
I1215 00:07:19.784348  4320 exec.cpp:237] Executor registered on agent c8e4e0c9-cc00-404f-b6ec-a81d26b237d4-S0
I1215 00:07:19.788349  7748 executor.cpp:171] Received SUBSCRIBED event
I1215 00:07:19.792330  7748 executor.cpp:175] Subscribed executor on build-srv-04.zq4gs31qjdiunm1ryi1452nvnh.dx.internal.cloudapp.net
I1215 00:07:19.792330  7748 executor.cpp:171] Received LAUNCH event
I1215 00:07:19.796350  7748 executor.cpp:638] Starting task c82b6c1c-acfd-4f82-a0da-3322d9ab5be1
I1215 00:07:19.869345  7748 executor.cpp:478] Running 'D:\DCOS\mesos\src\mesos-containerizer.exe
launch <POSSIBLY-SENSITIVE-DATA>'
I1215 00:07:20.394320  7748 executor.cpp:651] Forked command at 8812
I1215 00:07:20.419319  6644 exec.cpp:435] Executor asked to shutdown
I1215 00:07:20.420320   880 executor.cpp:171] Received SHUTDOWN event
I1215 00:07:20.420320   880 executor.cpp:748] Shutting down
I1215 00:07:20.420320   880 executor.cpp:855] Sending SIGTERM to process tree at pid 84f-b6ec-a81d26b237d4-0000
(latest state: TASK_KILLED, status update state: TASK_KILLED)
I1215 00:07:20.418342  4992 slave.cpp:6109] Shutting down executor 'c82b6c1c-acfd-4f82-a0da-3322d9ab5be1'
of framework c8e4e0c9-cc00-404f-b6ec-a81d26b237d4-0000 at executor(1)@10.3.1.5:53598
I1215 00:07:20.419319  4992 slave.cpp:909] Agent terminating
W1215 00:07:20.419319  4992 slave.cpp:3397] Ignoring shutdown framework c8e4e0c9-cc00-404f-b6ec-a81d26b237d4-0000
because it is terminating
I1215 00:07:20.421320  1716 master.cpp:10266] Removing task c82b6c1c-acfd-4f82-a0da-3322d9ab5be1
with resources cpus(allocated: *):4; mem(allocated: *):2048; disk(allocated: *):1024; ports(allocated:
*):[31000-32000] of framework c8e4e0c9-cc00-404f-b6ec-a81d26b237d4-0000 on agent c8e4e0c9-cc00-404f-b6ec-a81d26b237d4-S0
at slave(327)@10.3.1.5:53577 (build-srv-04.zq4gs31qjdiunm1ryi1452nvnh.dx.internal.cloudapp.net)
I1215 00:07:20.422320  6024 containerizer.cpp:2337] Destroying container 9857200e-9511-49d4-bcde-ce1478b370fb
in RUNNING state
I1215 00:07:20.422320  6024 containerizer.cpp:2939] Transitioning the state of container 9857200e-9511-49d4-bcde-ce1478b370fb
from RUNNING to DESTROYING
I1215 00:07:20.423318  1716 master.cpp:1305] Agent c8e4e0c9-cc00-404f-b6ec-a81d26b237d4-S0
at slave(327)@10.3.1.5:53577 (build-srv-04.zq4gs31qjdiunm1ryi1452nvnh.dx.internal.cloudapp.net)
disconnected
I1215 00:07:20.423318  1716 master.cpp:3364] Disconnecting agent c8e4e0c9-cc00-404f-b6ec-a81d26b237d4-S0
at slave(327)@10.3.1.5:53577 (build-srv-04.zq4gs31qjdiunm1ryi1452nvnh.dx.internal.cloudapp.net)
I1215 00:07:20.423318  1716 master.cpp:3383] Deactivating agent c8e4e0c9-cc00-404f-b6ec-a81d26b237d4-S0
at slave(327)@10.3.1.5:53577 (build-srv-04.zq4gs31qjdiunm1ryi1452nvnh.dx.internal.cloudapp.net)
I1215 00:07:20.424320  6024 launcher.cpp:156] Asked to destroy container 9857200e-9511-49d4-bcde-ce1478b370fb
I1215 00:07:20.424320  3820 hierarchical.cpp:344] Removed framework c8e4e0c9-cc00-404f-b6ec-a81d26b237d4-0000
I1215 00:07:20.424320  3820 hierarchical.cpp:766] Agent c8e4e0c9-cc00-404f-b6ec-a81d26b237d4-S0
deactivated
I1215 00:07:20.433339  8252 containerizer.cpp:2788] Container 9857200e-9511-49d4-bcde-ce1478b370fb
has exited
I1215 00:07:20.461320   444 master.cpp:1147] Master terminating
I1215 00:07:20.463340  3820 hierarchical.cpp:609] Removed agent c8e4e0c9-cc00-404f-b6ec-a81d26b237d4-S0
I1215 00:07:20.751348  4648 process.cpp:887] Failed to accept socket: future discarded
```

- Mesos Reviewbot Windows


On Dec. 14, 2017, 10:22 a.m., Gaston Kleiman wrote:
> 
> -----------------------------------------------------------
> This is an automatically generated e-mail. To reply, visit:
> https://reviews.apache.org/r/64590/
> -----------------------------------------------------------
> 
> (Updated Dec. 14, 2017, 10:22 a.m.)
> 
> 
> Review request for mesos, Chun-Hung Hsiao, Greg Mann, and Jie Yu.
> 
> 
> Repository: mesos
> 
> 
> Description
> -------
> 
> The `operation_id` and `framework_id` fields are optional, so they
> should only be logged if set.
> 
> 
> Diffs
> -----
> 
>   src/slave/slave.cpp 9d0e9debf2ecd142eb6179c12ef4a0ada24b1c6c 
> 
> 
> Diff: https://reviews.apache.org/r/64590/diff/3/
> 
> 
> Testing
> -------
> 
> `make check` on GNU/Linux
> 
> 
> Thanks,
> 
> Gaston Kleiman
> 
>


Mime
  • Unnamed multipart/alternative (inline, None, 0 bytes)
View raw message