mesos-reviews mailing list archives

Site index · List index
Message view « Date » · « Thread »
Top « Date » · « Thread »
From Mesos Reviewbot Windows <revi...@mesos.apache.org>
Subject Re: Review Request 64574: Ensured trailing '/' in URL is insignificant.
Date Wed, 13 Dec 2017 14:32:40 GMT

-----------------------------------------------------------
This is an automatically generated e-mail. To reply, visit:
https://reviews.apache.org/r/64574/#review193678
-----------------------------------------------------------



FAIL: Some Mesos tests failed.

Reviews applied: `['64574']`

Failed command: `D:\DCOS\mesos\src\mesos-tests.exe --verbose`

All the build artifacts available at: http://dcos-win.westus.cloudapp.azure.com/mesos-build/review/64574

Relevant logs:

- [mesos-tests-stdout.log](http://dcos-win.westus.cloudapp.azure.com/mesos-build/review/64574/logs/mesos-tests-stdout.log):

```

[----------] 1 test from IsolationFlag/CpuIsolatorTest
[ RUN      ] IsolationFlag/CpuIsolatorTest.ROOT_UserCpuUsage/0
[       OK ] IsolationFlag/CpuIsolatorTest.ROOT_UserCpuUsage/0 (2550 ms)
[----------] 1 test from IsolationFlag/CpuIsolatorTest (2573 ms total)

[----------] 1 test from IsolationFlag/MemoryIsolatorTest
[ RUN      ] IsolationFlag/MemoryIsolatorTest.ROOT_MemUsage/0
[       OK ] IsolationFlag/MemoryIsolatorTest.ROOT_MemUsage/0 (2476 ms)
[----------] 1 test from IsolationFlag/MemoryIsolatorTest (2500 ms total)

[----------] Global test environment tear-down
[==========] 829 tests from 84 test cases ran. (334251 ms total)
[  PASSED  ] 819 tests.
[  FAILED  ] 10 tests, listed below:
[  FAILED  ] OfferOperationStatusUpdateManagerTest.UpdateAndAckNonTerminalUpdate
[  FAILED  ] OfferOperationStatusUpdateManagerTest.RecoverCheckpointedStream
[  FAILED  ] OfferOperationStatusUpdateManagerTest.RecoverEmptyFile
[  FAILED  ] OfferOperationStatusUpdateManagerTest.RecoverTerminatedStream
[  FAILED  ] OfferOperationStatusUpdateManagerTest.IgnoreDuplicateUpdate
[  FAILED  ] OfferOperationStatusUpdateManagerTest.IgnoreDuplicateUpdateAfterRecover
[  FAILED  ] OfferOperationStatusUpdateManagerTest.RejectDuplicateAck
[  FAILED  ] OfferOperationStatusUpdateManagerTest.RejectDuplicateAckAfterRecover
[  FAILED  ] OfferOperationStatusUpdateManagerTest.NonStrictRecoveryCorruptedFile
[  FAILED  ] SlaveTest.ResourceProviderPublishAll

10 FAILED TESTS
  YOU HAVE 201 DISABLED TESTS

```

- [mesos-tests-stderr.log](http://dcos-win.westus.cloudapp.azure.com/mesos-build/review/64574/logs/mesos-tests-stderr.log):

```
I1213 14:32:19.697907   432 master.cpp:10158] Updating the state of task 0f46e60I1213 14:32:18.942925
 2320 exec.cpp:162] Version: 1.5.0
I1213 14:32:18.967929  3752 exec.cpp:237] Executor registered on agent ae551b65-58c1-41a5-a388-e31c3ff41e65-S0
I1213 14:32:18.971071  5216 executor.cpp:171] Received SUBSCRIBED event
I1213 14:32:18.974937  5216 executor.cpp:175] Subscribed executor on build-srv-03.zq4gs31qjdiunm1ryi1452nvnh.dx.internal.cloudapp.net
I1213 14:32:18.975925  5216 executor.cpp:171] Received LAUNCH event
I1213 14:32:18.979897  5216 executor.cpp:637] Starting task 0f46e603-1ec5-4ac8-b5d1-652231a56ca4
I1213 14:32:19.060920  5216 executor.cpp:477] Running 'D:\DCOS\mesos\src\mesos-containerizer.exe
launch <POSSIBLY-SENSITIVE-DATA>'
I1213 14:32:19.670886  5216 executor.cpp:650] Forked command at 4200
I1213 14:32:19.699883  2320 exec.cpp:435] Executor asked to shutdown
I1213 14:32:19.700882  8220 executor.cpp:171] Received SHUTDOWN event
I1213 14:32:19.700882  8220 executor.cpp:747] Shutting down
I1213 14:32:19.700882  8220 executor.cpp:854] Sending SIGTERM to process tree at pid 43-1ec5-4ac8-b5d1-652231a56ca4
of framework ae551b65-58c1-41a5-a388-e31c3ff41e65-0000 (latest state: TASK_KILLED, status
update state: TASK_KILLED)
I1213 14:32:19.697907  7724 slave.cpp:3400] Shutting down framework ae551b65-58c1-41a5-a388-e31c3ff41e65-0000
I1213 14:32:19.698895  7724 slave.cpp:6114] Shutting down executor '0f46e603-1ec5-4ac8-b5d1-652231a56ca4'
of framework ae551b65-58c1-41a5-a388-e31c3ff41e65-0000 at executor(1)@10.3.1.11:64393
I1213 14:32:19.698895  7724 slave.cpp:909] Agent terminating
W1213 14:32:19.699883  7724 slave.cpp:3396] Ignoring shutdown framework ae551b65-58c1-41a5-a388-e31c3ff41e65-0000
because it is terminating
I1213 14:32:19.700882   432 master.cpp:10264] Removing task 0f46e603-1ec5-4ac8-b5d1-652231a56ca4
with resources cpus(allocated: *):4; mem(allocated: *):2048; disk(allocated: *):1024; ports(allocated:
*):[31000-32000] of framework ae551b65-58c1-41a5-a388-e31c3ff41e65-0000 on agent ae551b65-58c1-41a5-a388-e31c3ff41e65-S0
at slave(326)@10.3.1.11:64372 (build-srv-03.zq4gs31qjdiunm1ryi1452nvnh.dx.internal.cloudapp.net)
I1213 14:32:19.702881  6800 containerizer.cpp:2337] Destroying container 9741fef6-75d3-4aad-9265-8f3d1550be74
in RUNNING state
I1213 14:32:19.702881  6800 containerizer.cpp:2939] Transitioning the state of container 9741fef6-75d3-4aad-9265-8f3d1550be74
from RUNNING to DESTROYING
I1213 14:32:19.703905  6800 launcher.cpp:156] Asked to destroy container 9741fef6-75d3-4aad-9265-8f3d1550be74
I1213 14:32:19.703905   432 master.cpp:1305] Agent ae551b65-58c1-41a5-a388-e31c3ff41e65-S0
at slave(326)@10.3.1.11:64372 (build-srv-03.zq4gs31qjdiunm1ryi1452nvnh.dx.internal.cloudapp.net)
disconnected
I1213 14:32:19.703905   432 master.cpp:3364] Disconnecting agent ae551b65-58c1-41a5-a388-e31c3ff41e65-S0
at slave(326)@10.3.1.11:64372 (build-srv-03.zq4gs31qjdiunm1ryi1452nvnh.dx.internal.cloudapp.net)
I1213 14:32:19.703905  1860 hierarchical.cpp:344] Removed framework ae551b65-58c1-41a5-a388-e31c3ff41e65-0000
I1213 14:32:19.703905   432 master.cpp:3383] Deactivating agent ae551b65-58c1-41a5-a388-e31c3ff41e65-S0
at slave(326)@10.3.1.11:64372 (build-srv-03.zq4gs31qjdiunm1ryi1452nvnh.dx.internal.cloudapp.net)
I1213 14:32:19.704882  2428 hierarchical.cpp:766] Agent ae551b65-58c1-41a5-a388-e31c3ff41e65-S0
deactivated
I1213 14:32:19.705881  1860 containerizer.cpp:2788] Container 9741fef6-75d3-4aad-9265-8f3d1550be74
has exited
I1213 14:32:19.733886  3928 master.cpp:1147] Master terminating
I1213 14:32:19.735883  5344 hierarchical.cpp:609] Removed agent ae551b65-58c1-41a5-a388-e31c3ff41e65-S0
I1213 14:32:20.082010  3644 process.cpp:887] Failed to accept socket: future discarded
```

- Mesos Reviewbot Windows


On Dec. 13, 2017, 1:39 p.m., Alexander Rukletsov wrote:
> 
> -----------------------------------------------------------
> This is an automatically generated e-mail. To reply, visit:
> https://reviews.apache.org/r/64574/
> -----------------------------------------------------------
> 
> (Updated Dec. 13, 2017, 1:39 p.m.)
> 
> 
> Review request for mesos, Benjamin Bannier and Benjamin Mahler.
> 
> 
> Bugs: MESOS-5333
>     https://issues.apache.org/jira/browse/MESOS-5333
> 
> 
> Repository: mesos
> 
> 
> Description
> -------
> 
> Prior to this patch, adding a trailing '/' to a valid URL path, e.g.,
> "/state/", yielded a 404 response. This patch ensures that two URLs
> which differ only in trailing '/' produce the same result.
> 
> 
> Diffs
> -----
> 
>   3rdparty/libprocess/src/process.cpp 75cf1d3b6d3d257ba9bc81c68017a74a6511cebf 
>   3rdparty/libprocess/src/tests/http_tests.cpp 9daac715f0242921b7f9f5c20b3eb27f1be802d4

> 
> 
> Diff: https://reviews.apache.org/r/64574/diff/1/
> 
> 
> Testing
> -------
> 
> Ensured the modified test fails without the fix.
> `make check` on Mac OS 10.11.6 and several Linux distributions.
> 
> 
> Thanks,
> 
> Alexander Rukletsov
> 
>


Mime
  • Unnamed multipart/alternative (inline, None, 0 bytes)
View raw message