mesos-reviews mailing list archives

Site index · List index
Message view « Date » · « Thread »
Top « Date » · « Thread »
From Mesos Reviewbot Windows <revi...@mesos.apache.org>
Subject Re: Review Request 64168: Introduced a 'UUID' type.
Date Wed, 13 Dec 2017 11:57:50 GMT

-----------------------------------------------------------
This is an automatically generated e-mail. To reply, visit:
https://reviews.apache.org/r/64168/#review193672
-----------------------------------------------------------



FAIL: Some Mesos tests failed.

Reviews applied: `['64381', '64380', '64168']`

Failed command: `D:\DCOS\mesos\src\mesos-tests.exe --verbose`

All the build artifacts available at: http://dcos-win.westus.cloudapp.azure.com/mesos-build/review/64168

Relevant logs:

- [mesos-tests-stdout.log](http://dcos-win.westus.cloudapp.azure.com/mesos-build/review/64168/logs/mesos-tests-stdout.log):

```

[----------] 1 test from IsolationFlag/CpuIsolatorTest
[ RUN      ] IsolationFlag/CpuIsolatorTest.ROOT_UserCpuUsage/0
[       OK ] IsolationFlag/CpuIsolatorTest.ROOT_UserCpuUsage/0 (2337 ms)
[----------] 1 test from IsolationFlag/CpuIsolatorTest (2359 ms total)

[----------] 1 test from IsolationFlag/MemoryIsolatorTest
[ RUN      ] IsolationFlag/MemoryIsolatorTest.ROOT_MemUsage/0
[       OK ] IsolationFlag/MemoryIsolatorTest.ROOT_MemUsage/0 (2268 ms)
[----------] 1 test from IsolationFlag/MemoryIsolatorTest (2290 ms total)

[----------] Global test environment tear-down
[==========] 829 tests from 84 test cases ran. (304659 ms total)
[  PASSED  ] 819 tests.
[  FAILED  ] 10 tests, listed below:
[  FAILED  ] OfferOperationStatusUpdateManagerTest.UpdateAndAckNonTerminalUpdate
[  FAILED  ] OfferOperationStatusUpdateManagerTest.RecoverCheckpointedStream
[  FAILED  ] OfferOperationStatusUpdateManagerTest.RecoverEmptyFile
[  FAILED  ] OfferOperationStatusUpdateManagerTest.RecoverTerminatedStream
[  FAILED  ] OfferOperationStatusUpdateManagerTest.IgnoreDuplicateUpdate
[  FAILED  ] OfferOperationStatusUpdateManagerTest.IgnoreDuplicateUpdateAfterRecover
[  FAILED  ] OfferOperationStatusUpdateManagerTest.RejectDuplicateAck
[  FAILED  ] OfferOperationStatusUpdateManagerTest.RejectDuplicateAckAfterRecover
[  FAILED  ] OfferOperationStatusUpdateManagerTest.NonStrictRecoveryCorruptedFile
[  FAILED  ] SlaveTest.ResourceProviderPublishAll

10 FAILED TESTS
  YOU HAVE 204 DISABLED TESTS

```

- [mesos-tests-stderr.log](http://dcos-win.westus.cloudapp.azure.com/mesos-build/review/64168/logs/mesos-tests-stderr.log):

```
I1213 11:57:27.590729  7676 exec.cpp:237] Executor registered on agent 56325295-761c-45fb-88b2-dacb3aa5bc6e-S0
I1213 11:57:27.593711  1008 executor.cpp:171] Received SUBSCRIBED event
I1213 11:57:27.597731  1008 executor.cpp:175] Subscribed executor on build-srv-04.zq4gs31qjdiunm1ryi1452nvnh.dx.internal.cloudapp.net
I1213 11:57:27.597731  1008 executor.cpp:171] Received LAUNCH event
I1213 11:57:27.601728  1008 executor.cpp:638] Starting task 6ddab971-66f8-4d8a-871f-90f5db4f918d
I1213 11:57:27.674726  1008 executor.cpp:478] Running 'D:\DCOS\mesos\src\mesos-containerizer.exe
launch <POSSIBLY-SENSITIVE-DATA>'
I1213 11:57:28.191035  1008 executor.cpp:651] Forked command at 1412
I1213 11:57:28.216704  2000 exec.cpp:435] Executor asked to shutdown
I1213 11:57:28.216704  5032 executor.cpp:171] Received SHUTDOWN event
I1213 11:57:28.216704  5032 executor.cpp:748] Shutting down
I1213 11:57:28.217705  5032 executor.cpp:855] Sending SIGTERM to process tree at pid 1work
56325295-761c-45fb-88b2-dacb3aa5bc6e-0000
I1213 11:57:28.214728  6184 master.cpp:10164] Updating the state of task 6ddab971-66f8-4d8a-871f-90f5db4f918d
of framework 56325295-761c-45fb-88b2-dacb3aa5bc6e-0000 (latest state: TASK_KILLED, status
update state: TASK_KILLED)
I1213 11:57:28.214728  5868 slave.cpp:3401] Shutting down framework 56325295-761c-45fb-88b2-dacb3aa5bc6e-0000
I1213 11:57:28.215704  5868 slave.cpp:6117] Shutting down executor '6ddab971-66f8-4d8a-871f-90f5db4f918d'
of framework 56325295-761c-45fb-88b2-dacb3aa5bc6e-0000 at executor(1)@10.3.1.5:64501
I1213 11:57:28.215704  8776 slave.cpp:909] Agent terminating
W1213 11:57:28.216704  8776 slave.cpp:3397] Ignoring shutdown framework 56325295-761c-45fb-88b2-dacb3aa5bc6e-0000
because it is terminating
I1213 11:57:28.217705  6184 master.cpp:10270] Removing task 6ddab971-66f8-4d8a-871f-90f5db4f918d
with resources cpus(allocated: *):4; mem(allocated: *):2048; disk(allocated: *):1024; ports(allocated:
*):[31000-32000] of framework 56325295-761c-45fb-88b2-dacb3aa5bc6e-0000 on agent 56325295-761c-45fb-88b2-dacb3aa5bc6e-S0
at slave(326)@10.3.1.5:64480 (build-srv-04.zq4gs31qjdiunm1ryi1452nvnh.dx.internal.cloudapp.net)
I1213 11:57:28.218704  5868 containerizer.cpp:2337] Destroying container 72142273-6897-400a-9270-970343f7e9a3
in RUNNING state
I1213 11:57:28.219704  5868 containerizer.cpp:2939] Transitioning the state of container 72142273-6897-400a-9270-970343f7e9a3
from RUNNING to DESTROYING
I1213 11:57:28.219704  6184 master.cpp:1305] Agent 56325295-761c-45fb-88b2-dacb3aa5bc6e-S0
at slave(326)@10.3.1.5:64480 (build-srv-04.zq4gs31qjdiunm1ryi1452nvnh.dx.internal.cloudapp.net)
disconnected
I1213 11:57:28.219704  6184 master.cpp:3364] Disconnecting agent 56325295-761c-45fb-88b2-dacb3aa5bc6e-S0
at slave(326)@10.3.1.5:64480 (build-srv-04.zq4gs31qjdiunm1ryi1452nvnh.dx.internal.cloudapp.net)
I1213 11:57:28.219704  5868 launcher.cpp:156] Asked to destroy container 72142273-6897-400a-9270-970343f7e9a3
I1213 11:57:28.220723  6184 master.cpp:3383] Deactivating agent 56325295-761c-45fb-88b2-dacb3aa5bc6e-S0
at slave(326)@10.3.1.5:64480 (build-srv-04.zq4gs31qjdiunm1ryi1452nvnh.dx.internal.cloudapp.net)
I1213 11:57:28.220723  1152 hierarchical.cpp:344] Removed framework 56325295-761c-45fb-88b2-dacb3aa5bc6e-0000
I1213 11:57:28.220723  1152 hierarchical.cpp:766] Agent 56325295-761c-45fb-88b2-dacb3aa5bc6e-S0
deactivated
I1213 11:57:28.259798  7208 containerizer.cpp:2788] Container 72142273-6897-400a-9270-970343f7e9a3
has exited
I1213 11:57:28.288825  8776 master.cpp:1147] Master terminating
I1213 11:57:28.290824  8860 hierarchical.cpp:609] Removed agent 56325295-761c-45fb-88b2-dacb3aa5bc6e-S0
I1213 11:57:28.598820  6744 process.cpp:887] Failed to accept socket: future discarded
```

- Mesos Reviewbot Windows


On Dec. 13, 2017, 4:38 p.m., Jan Schlicht wrote:
> 
> -----------------------------------------------------------
> This is an automatically generated e-mail. To reply, visit:
> https://reviews.apache.org/r/64168/
> -----------------------------------------------------------
> 
> (Updated Dec. 13, 2017, 4:38 p.m.)
> 
> 
> Review request for mesos, Benjamin Bannier and Jie Yu.
> 
> 
> Bugs: MESOS-8309
>     https://issues.apache.org/jira/browse/MESOS-8309
> 
> 
> Repository: mesos
> 
> 
> Description
> -------
> 
> Introduced a 'UUID' type.
> 
> 
> Diffs
> -----
> 
>   include/mesos/mesos.proto 9e4c66946a69a202978ab9db396288638b9d86ad 
>   include/mesos/resource_provider/resource_provider.proto 7ec693628451abd3c4da800a021a488c2d01eb50

>   include/mesos/type_utils.hpp 1bcc521546cf017ca5b33cb4edd509ce3aa64d5a 
>   include/mesos/v1/mesos.proto f1649bb98cb1b34ef49aaf122bd1a83e032e74ff 
>   include/mesos/v1/resource_provider/resource_provider.proto 31e8954b053c1541d2d0eba90ae9d0a7051b74ce

>   src/common/protobuf_utils.cpp 3bc72e4ca4517d5af2d8ec64cf3480e4c050ae20 
>   src/common/type_utils.cpp 65586a57b6d384350673903fb399b89a83fb9c37 
>   src/master/master.hpp 232cc3758f240db626c4fdaf852163fa48af4dd7 
>   src/master/master.cpp 806fbc275af11bb37c2daa369f69a71bc4f36312 
>   src/messages/messages.cpp 56876f2d5a92237ccb85ec6d8ab8eb872061a7b5 
>   src/messages/messages.proto e680cd5e4d5a93c3c77309f327844f55fbb239a1 
>   src/resource_provider/manager.cpp fd138b9914d925b5be7a11255dd632921c107dba 
>   src/resource_provider/message.hpp eab90cffd6aab9e38207dcf109cc737171ed3953 
>   src/slave/slave.cpp d997b4272578efffed05d38771f17df387ccac48 
>   src/status_update_manager/offer_operation.cpp 986310e995e473449e80a9e80ff6ac10d8836be6

>   src/status_update_manager/status_update_manager_process.hpp 8c9e06ff4c5e9f28cd6eb559a0e2c39727520ea0

>   src/tests/mesos.hpp 320e9755c73bcf19ba8ac87f2081f17fdaa438ea 
>   src/tests/offer_operation_status_update_manager_tests.cpp a5327d3d070a390f2ceb918dc53a024fbfe8777e

>   src/tests/resource_provider_manager_tests.cpp e37a53ac6a03e2ea58dd6580fc8a399a1398d950

>   src/tests/resource_provider_validation_tests.cpp bf789a05771b7c25f2fc2a8a5b35d38519e4793b

>   src/tests/slave_tests.cpp 5228e03af1585817108094c587da6ae30d67df67 
> 
> 
> Diff: https://reviews.apache.org/r/64168/diff/7/
> 
> 
> Testing
> -------
> 
> make check
> 
> 
> Thanks,
> 
> Jan Schlicht
> 
>


Mime
  • Unnamed multipart/alternative (inline, None, 0 bytes)
View raw message