mesos-reviews mailing list archives

Site index · List index
Message view « Date » · « Thread »
Top « Date » · « Thread »
From Mesos Reviewbot Windows <revi...@mesos.apache.org>
Subject Re: Review Request 64561: Removed resource categories in UpdateSlaveMessage.
Date Wed, 13 Dec 2017 04:22:32 GMT

-----------------------------------------------------------
This is an automatically generated e-mail. To reply, visit:
https://reviews.apache.org/r/64561/#review193641
-----------------------------------------------------------



FAIL: Some Mesos tests failed.

Reviews applied: `['64557', '64561']`

Failed command: `D:\DCOS\mesos\src\mesos-tests.exe --verbose`

All the build artifacts available at: http://dcos-win.westus.cloudapp.azure.com/mesos-build/review/64561

Relevant logs:

- [mesos-tests-stdout.log](http://dcos-win.westus.cloudapp.azure.com/mesos-build/review/64561/logs/mesos-tests-stdout.log):

```

[----------] 1 test from IsolationFlag/CpuIsolatorTest
[ RUN      ] IsolationFlag/CpuIsolatorTest.ROOT_UserCpuUsage/0
[       OK ] IsolationFlag/CpuIsolatorTest.ROOT_UserCpuUsage/0 (2430 ms)
[----------] 1 test from IsolationFlag/CpuIsolatorTest (2455 ms total)

[----------] 1 test from IsolationFlag/MemoryIsolatorTest
[ RUN      ] IsolationFlag/MemoryIsolatorTest.ROOT_MemUsage/0
[       OK ] IsolationFlag/MemoryIsolatorTest.ROOT_MemUsage/0 (2373 ms)
[----------] 1 test from IsolationFlag/MemoryIsolatorTest (2397 ms total)

[----------] Global test environment tear-down
[==========] 831 tests from 84 test cases ran. (323528 ms total)
[  PASSED  ] 821 tests.
[  FAILED  ] 10 tests, listed below:
[  FAILED  ] OfferOperationStatusUpdateManagerTest.UpdateAndAckNonTerminalUpdate
[  FAILED  ] OfferOperationStatusUpdateManagerTest.RecoverCheckpointedStream
[  FAILED  ] OfferOperationStatusUpdateManagerTest.RecoverEmptyFile
[  FAILED  ] OfferOperationStatusUpdateManagerTest.RecoverTerminatedStream
[  FAILED  ] OfferOperationStatusUpdateManagerTest.IgnoreDuplicateUpdate
[  FAILED  ] OfferOperationStatusUpdateManagerTest.IgnoreDuplicateUpdateAfterRecover
[  FAILED  ] OfferOperationStatusUpdateManagerTest.RejectDuplicateAck
[  FAILED  ] OfferOperationStatusUpdateManagerTest.RejectDuplicateAckAfterRecover
[  FAILED  ] OfferOperationStatusUpdateManagerTest.NonStrictRecoveryCorruptedFile
[  FAILED  ] SlaveTest.ResourceProviderPublishAll

10 FAILED TESTS
  YOU HAVE 201 DISABLED TESTS

```

- [mesos-tests-stderr.log](http://dcos-win.westus.cloudapp.azure.com/mesos-build/review/64561/logs/mesos-tests-stderr.log):

```
I1213 04:22:15.114867  3156 master.cpp:10154] Updating the state of task ad428d78-1454-409e-972f-2ae2f2f736e9
of framework c7b0dfca-1739-4662-8320-06724dd392ec-0000 (latest state: TASK_KILLED, status
update state: TASK_KILLED)
I1213 04:22:15.115867  5100 slave.cpp:3400] Shutting down framework c7b0dfca-1739-4662-8320-06724dd392ec-0000
I1213 04:22:15.115867  5100 slave.cpp:6114] SI1213 04:22:14.415889  5280 exec.cpp:162] Version:
1.5.0
I1213 04:22:14.439934  1604 exec.cpp:237] Executor registered on agent c7b0dfca-1739-4662-8320-06724dd392ec-S0
I1213 04:22:14.442921  6824 executor.cpp:171] Received SUBSCRIBED event
I1213 04:22:14.446918  6824 executor.cpp:175] Subscribed executor on build-srv-03.zq4gs31qjdiunm1ryi1452nvnh.dx.internal.cloudapp.net
I1213 04:22:14.447918  6824 executor.cpp:171] Received LAUNCH event
I1213 04:22:14.451931  6824 executor.cpp:637] Starting task ad428d78-1454-409e-972f-2ae2f2f736e9
I1213 04:22:14.533891  6824 executor.cpp:477] Running 'D:\DCOS\mesos\src\mesos-containerizer.exe
launch <POSSIBLY-SENSITIVE-DATA>'
I1213 04:22:15.088878  6824 executor.cpp:650] Forked command at 3060
I1213 04:22:15.117868  2428 exec.cpp:435] Executor asked to shutdown
I1213 04:22:15.117868  6824 executor.cpp:171] Received SHUTDOWN event
I1213 04:22:15.117868  6824 executor.cpp:747] Shutting down
I1213 04:22:15.117868  6824 executor.cpp:854] Sending SIGTERM to process tree at pid 3hutting
down executor 'ad428d78-1454-409e-972f-2ae2f2f736e9' of framework c7b0dfca-1739-4662-8320-06724dd392ec-0000
at executor(1)@10.3.1.11:61392
I1213 04:22:15.116868  5100 slave.cpp:909] Agent terminating
W1213 04:22:15.116868  5100 slave.cpp:3396] Ignoring shutdown framework c7b0dfca-1739-4662-8320-06724dd392ec-0000
because it is terminating
I1213 04:22:15.117868  3156 master.cpp:10260] Removing task ad428d78-1454-409e-972f-2ae2f2f736e9
with resources cpus(allocated: *):4; mem(allocated: *):2048; disk(allocated: *):1024; ports(allocated:
*):[31000-32000] of framework c7b0dfca-1739-4662-8320-06724dd392ec-0000 on agent c7b0dfca-1739-4662-8320-06724dd392ec-S0
at slave(328)@10.3.1.11:61371 (build-srv-03.zq4gs31qjdiunm1ryi1452nvnh.dx.internal.cloudapp.net)
I1213 04:22:15.119868  3156 master.cpp:1305] Agent c7b0dfca-1739-4662-8320-06724dd392ec-S0
at slave(328)@10.3.1.11:61371 (build-srv-03.zq4gs31qjdiunm1ryi1452nvnh.dx.internal.cloudapp.net)
disconnected
I1213 04:22:15.119868  3156 master.cpp:3364] Disconnecting agent c7b0dfca-1739-4662-8320-06724dd392ec-S0
at slave(328)@10.3.1.11:61371 (build-srv-03.zq4gs31qjdiunm1ryi1452nvnh.dx.internal.cloudapp.net)
I1213 04:22:15.119868  9832 containerizer.cpp:2328] Destroying container 34f12d3c-f5e9-496b-be50-1f57768b3e80
in RUNNING state
I1213 04:22:15.120872  6840 hierarchical.cpp:344] Removed framework c7b0dfca-1739-4662-8320-06724dd392ec-0000
I1213 04:22:15.120872  9832 containerizer.cpp:2930] Transitioning the state of container 34f12d3c-f5e9-496b-be50-1f57768b3e80
from RUNNING to DESTROYING
I1213 04:22:15.120872  3156 master.cpp:3383] Deactivating agent c7b0dfca-1739-4662-8320-06724dd392ec-S0
at slave(328)@10.3.1.11:61371 (build-srv-03.zq4gs31qjdiunm1ryi1452nvnh.dx.internal.cloudapp.net)
I1213 04:22:15.120872  5100 hierarchical.cpp:766] Agent c7b0dfca-1739-4662-8320-06724dd392ec-S0
deactivated
I1213 04:22:15.121871  9832 launcher.cpp:156] Asked to destroy container 34f12d3c-f5e9-496b-be50-1f57768b3e80
I1213 04:22:15.151058  5100 containerizer.cpp:2779] Container 34f12d3c-f5e9-496b-be50-1f57768b3e80
has exited
I1213 04:22:15.180739   252 master.cpp:1147] Master terminating
I1213 04:22:15.182552  7476 hierarchical.cpp:609] Removed agent c7b0dfca-1739-4662-8320-06724dd392ec-S0
I1213 04:22:15.538542  1988 process.cpp:887] Failed to accept socket: future discarded
```

- Mesos Reviewbot Windows


On Dec. 13, 2017, 12:56 a.m., Jie Yu wrote:
> 
> -----------------------------------------------------------
> This is an automatically generated e-mail. To reply, visit:
> https://reviews.apache.org/r/64561/
> -----------------------------------------------------------
> 
> (Updated Dec. 13, 2017, 12:56 a.m.)
> 
> 
> Review request for mesos, Benjamin Bannier and Jan Schlicht.
> 
> 
> Repository: mesos
> 
> 
> Description
> -------
> 
> Given that now we use `UpdateSlaveMessage` to send resource provider
> information directly, having resource categories in the message is
> unnecessary and misleading.
> 
> Instead, this patch introduced a single optional boolean to indicate if
> oversubscribed resources need to be updated or not.
> 
> 
> Diffs
> -----
> 
>   src/master/master.hpp 232cc3758f240db626c4fdaf852163fa48af4dd7 
>   src/master/master.cpp efe8b8f1704b314e6e6a4d5632718cab2854e38f 
>   src/messages/messages.proto e680cd5e4d5a93c3c77309f327844f55fbb239a1 
>   src/slave/slave.hpp 7c40fc71b49057fea0cfd85290931fbd0f6a9d62 
>   src/slave/slave.cpp 5869e73ca1c14c99e580da9d7375181da2073ec5 
>   src/tests/oversubscription_tests.cpp 3f57ce105e24e9f9cd681d8d984dbe242aa51f75 
> 
> 
> Diff: https://reviews.apache.org/r/64561/diff/1/
> 
> 
> Testing
> -------
> 
> make check
> 
> 
> Thanks,
> 
> Jie Yu
> 
>


Mime
  • Unnamed multipart/alternative (inline, None, 0 bytes)
View raw message