mesos-reviews mailing list archives

Site index · List index
Message view « Date » · « Thread »
Top « Date » · « Thread »
From Mesos Reviewbot Windows <revi...@mesos.apache.org>
Subject Re: Review Request 64559: Checkpointing `OfferOperation` in resource provider states.
Date Wed, 13 Dec 2017 02:15:43 GMT

-----------------------------------------------------------
This is an automatically generated e-mail. To reply, visit:
https://reviews.apache.org/r/64559/#review193636
-----------------------------------------------------------



FAIL: Some Mesos tests failed.

Reviews applied: `['64521', '64475', '64559']`

Failed command: `D:\DCOS\mesos\src\mesos-tests.exe --verbose`

All the build artifacts available at: http://dcos-win.westus.cloudapp.azure.com/mesos-build/review/64559

Relevant logs:

- [mesos-tests-stdout.log](http://dcos-win.westus.cloudapp.azure.com/mesos-build/review/64559/logs/mesos-tests-stdout.log):

```
[----------] 1 test from IsolationFlag/CpuIsolatorTest
[ RUN      ] IsolationFlag/CpuIsolatorTest.ROOT_UserCpuUsage/0
[       OK ] IsolationFlag/CpuIsolatorTest.ROOT_UserCpuUsage/0 (2394 ms)
[----------] 1 test from IsolationFlag/CpuIsolatorTest (2416 ms total)

[----------] 1 test from IsolationFlag/MemoryIsolatorTest
[ RUN      ] IsolationFlag/MemoryIsolatorTest.ROOT_MemUsage/0
[       OK ] IsolationFlag/MemoryIsolatorTest.ROOT_MemUsage/0 (2377 ms)
[----------] 1 test from IsolationFlag/MemoryIsolatorTest (2399 ms total)

[----------] Global test environment tear-down
[==========] 830 tests from 84 test cases ran. (308749 ms total)
[  PASSED  ] 819 tests.
[  FAILED  ] 11 tests, listed below:
[  FAILED  ] OfferOperationStatusUpdateManagerTest.UpdateAndAckNonTerminalUpdate
[  FAILED  ] OfferOperationStatusUpdateManagerTest.RecoverCheckpointedStream
[  FAILED  ] OfferOperationStatusUpdateManagerTest.RecoverEmptyFile
[  FAILED  ] OfferOperationStatusUpdateManagerTest.RecoverTerminatedStream
[  FAILED  ] OfferOperationStatusUpdateManagerTest.IgnoreDuplicateUpdate
[  FAILED  ] OfferOperationStatusUpdateManagerTest.IgnoreDuplicateUpdateAfterRecover
[  FAILED  ] OfferOperationStatusUpdateManagerTest.RejectDuplicateAck
[  FAILED  ] OfferOperationStatusUpdateManagerTest.RejectDuplicateAckAfterRecover
[  FAILED  ] OfferOperationStatusUpdateManagerTest.NonStrictRecoveryCorruptedFile
[  FAILED  ] OfferOperationStatusUpdateManagerTest.UpdateLatestWhenResending
[  FAILED  ] SlaveTest.ResourceProviderPublishAll

11 FAILED TESTS
  YOU HAVE 204 DISABLED TESTS

```

- [mesos-tests-stderr.log](http://dcos-win.westus.cloudapp.azure.com/mesos-build/review/64559/logs/mesos-tests-stderr.log):

```
I1213 02:15:25.116502   452 master.cpp:10158] Updating the state of task 1537bacb-6889-48e5-a95d-02b62f947f6a
of framework c2c5066d-c610-4aa2-b10f-53065224bc8d-0000 (latest state: TASK_KILLED, status
update state: TASK_KILLED)
I1213 02:15:25.116502  8180 slave.cpp:3400] Shutting down framework c2c5066d-c610-4aa2-b10f-53065224bc8d-0000
I1213 02:15:25.117481  8180 slave.cpp:6114] Shutting down executor '1537bacb-6889-48e5-a95d-02b62f947f6a'
of framework c2c5066d-c610-4aa2-b10f-53065224bc8d-0000 at executor(1)@10.3.1.5:58813
I1213 02:15:25.118502  8180 slave.cpp:909] Agent terminating
W1213 02:15:25.118502  8180 slave.cpp:3396] Ignoring shutdown framework c2c5066d-c610-4aa2-b10f-53065224bc8d-0000
because it is terminating
I1213 02:15:25.119480   452 master.cpp:10264] Removing task 1537bacb-6889-48e5-a95d-02b62f947f6a
with resources cpus(allocated: *):4; mem(allocated: *):2048; disk(allocated: *):1024; ports(allocated:
*):[3I1213 02:15:24.437484  5440 exec.cpp:162] Version: 1.5.0
I1213 02:15:24.460510  5040 exec.cpp:237] Executor registered on agent c2c5066d-c610-4aa2-b10f-53065224bc8d-S0
I1213 02:15:24.464485  8704 executor.cpp:171] Received SUBSCRIBED event
I1213 02:15:24.468502  8704 executor.cpp:175] Subscribed executor on build-srv-04.zq4gs31qjdiunm1ryi1452nvnh.dx.internal.cloudapp.net
I1213 02:15:24.468502  8704 executor.cpp:171] Received LAUNCH event
I1213 02:15:24.472509  8704 executor.cpp:637] Starting task 1537bacb-6889-48e5-a95d-02b62f947f6a
I1213 02:15:24.547503  8704 executor.cpp:477] Running 'D:\DCOS\mesos\src\mesos-containerizer.exe
launch <POSSIBLY-SENSITIVE-DATA>'
I1213 02:15:25.087481  8704 executor.cpp:650] Forked command at 1760
I1213 02:15:25.118502  4128 exec.cpp:435] Executor asked to shutdown
I1213 02:15:25.119480  7408 executor.cpp:171] Received SHUTDOWN event
I1213 02:15:25.119480  7408 executor.cpp:747] Shutting down
I1213 02:15:25.119480  7408 executor.cpp:854] Sending SIGTERM to process tree at pid 11000-32000]
of framework c2c5066d-c610-4aa2-b10f-53065224bc8d-0000 on agent c2c5066d-c610-4aa2-b10f-53065224bc8d-S0
at slave(326)@10.3.1.5:58792 (build-srv-04.zq4gs31qjdiunm1ryi1452nvnh.dx.internal.cloudapp.net)
I1213 02:15:25.121481  8180 containerizer.cpp:2328] Destroying container a36336a7-78e0-45af-8dba-6b85f887048d
in RUNNING state
I1213 02:15:25.121481  8180 containerizer.cpp:2930] Transitioning the state of container a36336a7-78e0-45af-8dba-6b85f887048d
from RUNNING to DESTROYING
I1213 02:15:25.121481   452 master.cpp:1305] Agent c2c5066d-c610-4aa2-b10f-53065224bc8d-S0
at slave(326)@10.3.1.5:58792 (build-srv-04.zq4gs31qjdiunm1ryi1452nvnh.dx.internal.cloudapp.net)
disconnected
I1213 02:15:25.121481   452 master.cpp:3364] Disconnecting agent c2c5066d-c610-4aa2-b10f-53065224bc8d-S0
at slave(326)@10.3.1.5:58792 (build-srv-04.zq4gs31qjdiunm1ryi1452nvnh.dx.internal.cloudapp.net)
I1213 02:15:25.122503  8180 launcher.cpp:156] Asked to destroy container a36336a7-78e0-45af-8dba-6b85f887048d
I1213 02:15:25.122503   452 master.cpp:3383] Deactivating agent c2c5066d-c610-4aa2-b10f-53065224bc8d-S0
at slave(326)@10.3.1.5:58792 (build-srv-04.zq4gs31qjdiunm1ryi1452nvnh.dx.internal.cloudapp.net)
I1213 02:15:25.122503  3628 hierarchical.cpp:344] Removed framework c2c5066d-c610-4aa2-b10f-53065224bc8d-0000
I1213 02:15:25.122503  3628 hierarchical.cpp:766] Agent c2c5066d-c610-4aa2-b10f-53065224bc8d-S0
deactivated
I1213 02:15:25.230619  4012 containerizer.cpp:2779] Container a36336a7-78e0-45af-8dba-6b85f887048d
has exited
I1213 02:15:25.257647  7484 master.cpp:1147] Master terminating
I1213 02:15:25.259625  3812 hierarchical.cpp:609] Removed agent c2c5066d-c610-4aa2-b10f-53065224bc8d-S0
I1213 02:15:25.646621  8388 process.cpp:887] Failed to accept socket: future discarded
```

- Mesos Reviewbot Windows


On Dec. 13, 2017, 12:33 a.m., Chun-Hung Hsiao wrote:
> 
> -----------------------------------------------------------
> This is an automatically generated e-mail. To reply, visit:
> https://reviews.apache.org/r/64559/
> -----------------------------------------------------------
> 
> (Updated Dec. 13, 2017, 12:33 a.m.)
> 
> 
> Review request for mesos and Jie Yu.
> 
> 
> Repository: mesos
> 
> 
> Description
> -------
> 
> Instead of checkpointing `ApplyOfferOperation`, we now checkpoint
> `OfferOperations` in resource provider states such that we can keep
> track of completed operations as well.
> 
> This patch also does some code cleanup, and modifies a unit test for
> storage local resource provider to issue operations in batches.
> 
> 
> Diffs
> -----
> 
>   src/resource_provider/state.proto 321201e0aee9c104e831a6fa91f737216d8cd59a 
>   src/resource_provider/storage/provider.cpp e806f44ef33405d4a2b133576c60be56e9fe3435

>   src/tests/storage_local_resource_provider_tests.cpp e5868bfcb71977d2b2a146865f12a5207010ae40

> 
> 
> Diff: https://reviews.apache.org/r/64559/diff/1/
> 
> 
> Testing
> -------
> 
> sudo make check
> 
> 
> Thanks,
> 
> Chun-Hung Hsiao
> 
>


Mime
  • Unnamed multipart/alternative (inline, None, 0 bytes)
View raw message