mesos-reviews mailing list archives

Site index · List index
Message view « Date » · « Thread »
Top « Date » · « Thread »
From Mesos Reviewbot Windows <revi...@mesos.apache.org>
Subject Re: Review Request 64522: WIP: try to make tests pass on Windows.
Date Tue, 12 Dec 2017 23:07:28 GMT

-----------------------------------------------------------
This is an automatically generated e-mail. To reply, visit:
https://reviews.apache.org/r/64522/#review193622
-----------------------------------------------------------



FAIL: Some Mesos tests failed.

Reviews applied: `['64517', '64472', '64473', '64509', '64521', '64522']`

Failed command: `D:\DCOS\mesos\src\mesos-tests.exe --verbose`

All the build artifacts available at: http://dcos-win.westus.cloudapp.azure.com/mesos-build/review/64522

Relevant logs:

- [mesos-tests-stdout.log](http://dcos-win.westus.cloudapp.azure.com/mesos-build/review/64522/logs/mesos-tests-stdout.log):

```
[ RUN      ] ContainerizerType/DefaultContainerDNSFlagTest.ValidateFlag/1
[       OK ] ContainerizerType/DefaultContainerDNSFlagTest.ValidateFlag/1 (37 ms)
[----------] 2 tests from ContainerizerType/DefaultContainerDNSFlagTest (69 ms total)

[----------] 1 test from IsolationFlag/CpuIsolatorTest
[ RUN      ] IsolationFlag/CpuIsolatorTest.ROOT_UserCpuUsage/0
[       OK ] IsolationFlag/CpuIsolatorTest.ROOT_UserCpuUsage/0 (2300 ms)
[----------] 1 test from IsolationFlag/CpuIsolatorTest (2322 ms total)

[----------] 1 test from IsolationFlag/MemoryIsolatorTest
[ RUN      ] IsolationFlag/MemoryIsolatorTest.ROOT_MemUsage/0
[       OK ] IsolationFlag/MemoryIsolatorTest.ROOT_MemUsage/0 (2270 ms)
[----------] 1 test from IsolationFlag/MemoryIsolatorTest (2299 ms total)

[----------] Global test environment tear-down
[==========] 830 tests from 84 test cases ran. (309613 ms total)
[  PASSED  ] 823 tests.
[  FAILED  ] 7 tests, listed below:
[  FAILED  ] OfferOperationStatusUpdateManagerTest.RecoverCheckpointedStream
[  FAILED  ] OfferOperationStatusUpdateManagerTest.RecoverEmptyFile
[  FAILED  ] OfferOperationStatusUpdateManagerTest.RecoverTerminatedStream
[  FAILED  ] OfferOperationStatusUpdateManagerTest.IgnoreDuplicateUpdateAfterRecover
[  FAILED  ] OfferOperationStatusUpdateManagerTest.RejectDuplicateAckAfterRecover
[  FAILED  ] OfferOperationStatusUpdateManagerTest.NonStrictRecoveryCorruptedFile
[  FAILED  ] SlaveTest.ResourceProviderPublishAll

 7 FAILED TESTS
  YOU HAVE 204 DISABLED TESTS

```

- [mesos-tests-stderr.log](http://dcos-win.westus.cloudapp.azure.com/mesos-build/review/64522/logs/mesos-tests-stderr.log):

```
I1212 23:07:08.811098  8412 slave.cpp:3400] Shutting down framework 9d5c56a2-97da-4850-82c4-850eb9436c2d-0000
I1212 23:07:08.811098  8412 slave.cpp:6091] Shutting down executor '453234f7-65a1-483e-a46f-bcd8816085c9'
of framework 9d5c56a2-97da-4850-82c4-850eb9436c2d-0000 at executor(1)@10.3.1.5:52424
I1212 23:07:08.811098  1652 master.cpp:10146] Updating the state of task 453234f7-65a1-483e-a46f-bcd8816085c9
of framework 9d5c56a2-97da-4850-82c4-850eb9436c2d-0000 (latest state: TASK_KILLED, status
update state: TAI1212 23:07:08.148102  4416 exec.cpp:162] Version: 1.5.0
I1212 23:07:08.172078  8400 exec.cpp:237] Executor registered on agent 9d5c56a2-97da-4850-82c4-850eb9436c2d-S0
I1212 23:07:08.174113  3388 executor.cpp:171] Received SUBSCRIBED event
I1212 23:07:08.179103  3388 executor.cpp:175] Subscribed executor on build-srv-04.zq4gs31qjdiunm1ryi1452nvnh.dx.internal.cloudapp.net
I1212 23:07:08.179103  3388 executor.cpp:171] Received LAUNCH event
I1212 23:07:08.183106  3388 executor.cpp:637] Starting task 453234f7-65a1-483e-a46f-bcd8816085c9
I1212 23:07:08.257084  3388 executor.cpp:477] Running 'D:\DCOS\mesos\src\mesos-containerizer.exe
launch <POSSIBLY-SENSITIVE-DATA>'
I1212 23:07:08.786097  3388 executor.cpp:650] Forked command at 5976
I1212 23:07:08.812098  4108 exec.cpp:435] Executor asked to shutdown
I1212 23:07:08.813099  7580 executor.cpp:171] Received SHUTDOWN event
I1212 23:07:08.813099  7580 executor.cpp:747] Shutting down
I1212 23:07:08.813099  7580 executor.cpp:854] Sending SIGTERM to process tree at pid 5SK_KILLED)
I1212 23:07:08.812098  8412 slave.cpp:909] Agent terminating
W1212 23:07:08.812098  8412 slave.cpp:3396] Ignoring shutdown framework 9d5c56a2-97da-4850-82c4-850eb9436c2d-0000
because it is terminating
I1212 23:07:08.814098  1652 master.cpp:10252] Removing task 453234f7-65a1-483e-a46f-bcd8816085c9
with resources cpus(allocated: *):4; mem(allocated: *):2048; disk(allocated: *):1024; ports(allocated:
*):[31000-32000] of framework 9d5c56a2-97da-4850-82c4-850eb9436c2d-0000 on agent 9d5c56a2-97da-4850-82c4-850eb9436c2d-S0
at slave(326)@10.3.1.5:52403 (build-srv-04.zq4gs31qjdiunm1ryi1452nvnh.dx.internal.cloudapp.net)
I1212 23:07:08.815099  7796 containerizer.cpp:2328] Destroying container afbb257d-c221-4f84-8319-0bc5fe8ad210
in RUNNING state
I1212 23:07:08.815099  7796 containerizer.cpp:2930] Transitioning the state of container afbb257d-c221-4f84-8319-0bc5fe8ad210
from RUNNING to DESTROYING
I1212 23:07:08.816099  7796 launcher.cpp:156] Asked to destroy container afbb257d-c221-4f84-8319-0bc5fe8ad210
I1212 23:07:08.816099  1652 master.cpp:1305] Agent 9d5c56a2-97da-4850-82c4-850eb9436c2d-S0
at slave(326)@10.3.1.5:52403 (build-srv-04.zq4gs31qjdiunm1ryi1452nvnh.dx.internal.cloudapp.net)
disconnected
I1212 23:07:08.817098  1552 hierarchical.cpp:344] Removed framework 9d5c56a2-97da-4850-82c4-850eb9436c2d-0000
I1212 23:07:08.817098  1652 master.cpp:3364] Disconnecting agent 9d5c56a2-97da-4850-82c4-850eb9436c2d-S0
at slave(326)@10.3.1.5:52403 (build-srv-04.zq4gs31qjdiunm1ryi1452nvnh.dx.internal.cloudapp.net)
I1212 23:07:08.817098  1652 master.cpp:3383] Deactivating agent 9d5c56a2-97da-4850-82c4-850eb9436c2d-S0
at slave(326)@10.3.1.5:52403 (build-srv-04.zq4gs31qjdiunm1ryi1452nvnh.dx.internal.cloudapp.net)
I1212 23:07:08.818099  8260 hierarchical.cpp:766] Agent 9d5c56a2-97da-4850-82c4-850eb9436c2d-S0
deactivated
I1212 23:07:08.848124  7720 containerizer.cpp:2779] Container afbb257d-c221-4f84-8319-0bc5fe8ad210
has exited
I1212 23:07:08.877125  5420 master.cpp:1147] Master terminating
I1212 23:07:08.879102  7796 hierarchical.cpp:609] Removed agent 9d5c56a2-97da-4850-82c4-850eb9436c2d-S0
I1212 23:07:09.203110  6120 process.cpp:887] Failed to accept socket: future discarded
```

- Mesos Reviewbot Windows


On Dec. 12, 2017, 1:48 a.m., Gaston Kleiman wrote:
> 
> -----------------------------------------------------------
> This is an automatically generated e-mail. To reply, visit:
> https://reviews.apache.org/r/64522/
> -----------------------------------------------------------
> 
> (Updated Dec. 12, 2017, 1:48 a.m.)
> 
> 
> Review request for mesos and Gaston Kleiman.
> 
> 
> Repository: mesos
> 
> 
> Description
> -------
> 
> WIP: try to make tests pass on Windows.
> 
> 
> Diffs
> -----
> 
>   src/tests/offer_operation_status_update_manager_tests.cpp a5327d3d070a390f2ceb918dc53a024fbfe8777e

> 
> 
> Diff: https://reviews.apache.org/r/64522/diff/3/
> 
> 
> Testing
> -------
> 
> 
> Thanks,
> 
> Gaston Kleiman
> 
>


Mime
  • Unnamed multipart/alternative (inline, None, 0 bytes)
View raw message