mesos-reviews mailing list archives

Site index · List index
Message view « Date » · « Thread »
Top « Date » · « Thread »
From Mesos Reviewbot Windows <revi...@mesos.apache.org>
Subject Re: Review Request 64522: WIP: try to make tests pass on Windows.
Date Tue, 12 Dec 2017 20:41:45 GMT

-----------------------------------------------------------
This is an automatically generated e-mail. To reply, visit:
https://reviews.apache.org/r/64522/#review193604
-----------------------------------------------------------



FAIL: Some Mesos tests failed.

Reviews applied: `['64517', '64472', '64473', '64509', '64521', '64522']`

Failed command: `D:\DCOS\mesos\src\mesos-tests.exe --verbose`

All the build artifacts available at: http://dcos-win.westus.cloudapp.azure.com/mesos-build/review/64522

Relevant logs:

- [mesos-tests-stdout.log](http://dcos-win.westus.cloudapp.azure.com/mesos-build/review/64522/logs/mesos-tests-stdout.log):

```
[----------] 1 test from IsolationFlag/CpuIsolatorTest
[ RUN      ] IsolationFlag/CpuIsolatorTest.ROOT_UserCpuUsage/0
[       OK ] IsolationFlag/CpuIsolatorTest.ROOT_UserCpuUsage/0 (2359 ms)
[----------] 1 test from IsolationFlag/CpuIsolatorTest (2387 ms total)

[----------] 1 test from IsolationFlag/MemoryIsolatorTest
[ RUN      ] IsolationFlag/MemoryIsolatorTest.ROOT_MemUsage/0
[       OK ] IsolationFlag/MemoryIsolatorTest.ROOT_MemUsage/0 (2367 ms)
[----------] 1 test from IsolationFlag/MemoryIsolatorTest (2392 ms total)

[----------] Global test environment tear-down
[==========] 830 tests from 84 test cases ran. (323756 ms total)
[  PASSED  ] 819 tests.
[  FAILED  ] 11 tests, listed below:
[  FAILED  ] OfferOperationStatusUpdateManagerTest.UpdateAndAckNonTerminalUpdate
[  FAILED  ] OfferOperationStatusUpdateManagerTest.RecoverCheckpointedStream
[  FAILED  ] OfferOperationStatusUpdateManagerTest.RecoverEmptyFile
[  FAILED  ] OfferOperationStatusUpdateManagerTest.RecoverTerminatedStream
[  FAILED  ] OfferOperationStatusUpdateManagerTest.IgnoreDuplicateUpdate
[  FAILED  ] OfferOperationStatusUpdateManagerTest.IgnoreDuplicateUpdateAfterRecover
[  FAILED  ] OfferOperationStatusUpdateManagerTest.RejectDuplicateAck
[  FAILED  ] OfferOperationStatusUpdateManagerTest.RejectDuplicateAckAfterRecover
[  FAILED  ] OfferOperationStatusUpdateManagerTest.NonStrictRecoveryCorruptedFile
[  FAILED  ] OfferOperationStatusUpdateManagerTest.UpdateLatestWhenResending
[  FAILED  ] SlaveTest.ResourceProviderPublishAll

11 FAILED TESTS
  YOU HAVE 201 DISABLED TESTS

```

- [mesos-tests-stderr.log](http://dcos-win.westus.cloudapp.azure.com/mesos-build/review/64522/logs/mesos-tests-stderr.log):

```
I1212 20:41:19.765161  2624 exec.cpp:237] Executor registered on agent a2ed4f13-8018-4f90-820a-ffac2ca4629f-S0
I1212 20:41:19.768159  3512 executor.cpp:171] Received SUBSCRIBED event
I1212 20:41:19.772159  3512 executor.cpp:175] Subscribed executor on build-srv-03.zq4gs31qjdiunm1ryi1452nvnh.dx.internal.cloudapp.net
I1212 20:41:19.772159  3512 executor.cpp:171] Received LAUNCH event
I1212 20:41:19.776159  3512 executor.cpp:637] Starting task 9ffa43e5-8542-437a-a550-43b31f2e4d99
I1212 20:41:19.856178  3512 executor.cpp:477] Running 'D:\DCOS\mesos\src\mesos-containerizer.exe
launch <POSSIBLY-SENSITIVE-DATA>'
I1212 20:41:20.427151  3512 executor.cpp:650] Forked command at 1944
I1212 20:41:20.453151  5912 exec.cpp:435] Executor asked to shutdown
I1212 20:41:20.454150  3512 executor.cpp:171] Received SHUTDOWN event
I1212 20:41:20.454150  3512 executor.cpp:747] Shutting down
I1212 20:41:20.454150  3512 executor.cpp:854] Sending SIGTERM to process tree at pid 1erarchical.cpp:405]
Deactivated framework a2ed4f13-8018-4f90-820a-ffac2ca4629f-0000
I1212 20:41:20.451151   796 master.cpp:10146] Updating the state of task 9ffa43e5-8542-437a-a550-43b31f2e4d99
of framework a2ed4f13-8018-4f90-820a-ffac2ca4629f-0000 (latest state: TASK_KILLED, status
update state: TASK_KILLED)
I1212 20:41:20.451151 10068 slave.cpp:3400] Shutting down framework a2ed4f13-8018-4f90-820a-ffac2ca4629f-0000
I1212 20:41:20.452152 10068 slave.cpp:6091] Shutting down executor '9ffa43e5-8542-437a-a550-43b31f2e4d99'
of framework a2ed4f13-8018-4f90-820a-ffac2ca4629f-0000 at executor(1)@10.3.1.11:53409
I1212 20:41:20.453151 10068 slave.cpp:909] Agent terminating
W1212 20:41:20.453151 10068 slave.cpp:3396] Ignoring shutdown framework a2ed4f13-8018-4f90-820a-ffac2ca4629f-0000
because it is terminating
I1212 20:41:20.454150   796 master.cpp:10252] Removing task 9ffa43e5-8542-437a-a550-43b31f2e4d99
with resources cpus(allocated: *):4; mem(allocated: *):2048; disk(allocated: *):1024; ports(allocated:
*):[31000-32000] of framework a2ed4f13-8018-4f90-820a-ffac2ca4629f-0000 on agent a2ed4f13-8018-4f90-820a-ffac2ca4629f-S0
at slave(326)@10.3.1.11:53388 (build-srv-03.zq4gs31qjdiunm1ryi1452nvnh.dx.internal.cloudapp.net)
I1212 20:41:20.455150  5636 containerizer.cpp:2328] Destroying container d711ad02-00d5-49c2-a2be-46d32d37bf3b
in RUNNING state
I1212 20:41:20.456151  5636 containerizer.cpp:2930] Transitioning the state of container d711ad02-00d5-49c2-a2be-46d32d37bf3b
from RUNNING to DESTROYING
I1212 20:41:20.456151  5636 launcher.cpp:156] Asked to destroy container d711ad02-00d5-49c2-a2be-46d32d37bf3b
I1212 20:41:20.457150   796 master.cpp:1305] Agent a2ed4f13-8018-4f90-820a-ffac2ca4629f-S0
at slave(326)@10.3.1.11:53388 (build-srv-03.zq4gs31qjdiunm1ryi1452nvnh.dx.internal.cloudapp.net)
disconnected
I1212 20:41:20.457150   796 master.cpp:3364] Disconnecting agent a2ed4f13-8018-4f90-820a-ffac2ca4629f-S0
at slave(326)@10.3.1.11:53388 (build-srv-03.zq4gs31qjdiunm1ryi1452nvnh.dx.internal.cloudapp.net)
I1212 20:41:20.457150   796 master.cpp:3383] Deactivating agent a2ed4f13-8018-4f90-820a-ffac2ca4629f-S0
at slave(326)@10.3.1.11:53388 (build-srv-03.zq4gs31qjdiunm1ryi1452nvnh.dx.internal.cloudapp.net)
I1212 20:41:20.457150  3364 hierarchical.cpp:344] Removed framework a2ed4f13-8018-4f90-820a-ffac2ca4629f-0000
I1212 20:41:20.458150  8644 hierarchical.cpp:766] Agent a2ed4f13-8018-4f90-820a-ffac2ca4629f-S0
deactivated
I1212 20:41:20.471194 10068 containerizer.cpp:2779] Container d711ad02-00d5-49c2-a2be-46d32d37bf3b
has exited
I1212 20:41:20.500277  2328 master.cpp:1147] Master terminating
I1212 20:41:20.502239  3364 hierarchical.cpp:609] Removed agent a2ed4f13-8018-4f90-820a-ffac2ca4629f-S0
I1212 20:41:20.826263  4124 process.cpp:887] Failed to accept socket: future discarded
```

- Mesos Reviewbot Windows


On Dec. 11, 2017, 5:48 p.m., Gaston Kleiman wrote:
> 
> -----------------------------------------------------------
> This is an automatically generated e-mail. To reply, visit:
> https://reviews.apache.org/r/64522/
> -----------------------------------------------------------
> 
> (Updated Dec. 11, 2017, 5:48 p.m.)
> 
> 
> Review request for mesos and Gaston Kleiman.
> 
> 
> Repository: mesos
> 
> 
> Description
> -------
> 
> WIP: try to make tests pass on Windows.
> 
> 
> Diffs
> -----
> 
>   src/tests/offer_operation_status_update_manager_tests.cpp a5327d3d070a390f2ceb918dc53a024fbfe8777e

> 
> 
> Diff: https://reviews.apache.org/r/64522/diff/2/
> 
> 
> Testing
> -------
> 
> 
> Thanks,
> 
> Gaston Kleiman
> 
>


Mime
  • Unnamed multipart/alternative (inline, None, 0 bytes)
View raw message