mesos-reviews mailing list archives

Site index · List index
Message view « Date » · « Thread »
Top « Date » · « Thread »
From Mesos Reviewbot Windows <revi...@mesos.apache.org>
Subject Re: Review Request 64548: Made the agent respond to reconciliation requests for default resources.
Date Tue, 12 Dec 2017 19:42:17 GMT

-----------------------------------------------------------
This is an automatically generated e-mail. To reply, visit:
https://reviews.apache.org/r/64548/#review193597
-----------------------------------------------------------



FAIL: Some Mesos tests failed.

Reviews applied: `['64548']`

Failed command: `D:\DCOS\mesos\src\mesos-tests.exe --verbose`

All the build artifacts available at: http://dcos-win.westus.cloudapp.azure.com/mesos-build/review/64548

Relevant logs:

- [mesos-tests-stdout.log](http://dcos-win.westus.cloudapp.azure.com/mesos-build/review/64548/logs/mesos-tests-stdout.log):

```

[----------] 1 test from IsolationFlag/CpuIsolatorTest
[ RUN      ] IsolationFlag/CpuIsolatorTest.ROOT_UserCpuUsage/0
[       OK ] IsolationFlag/CpuIsolatorTest.ROOT_UserCpuUsage/0 (2449 ms)
[----------] 1 test from IsolationFlag/CpuIsolatorTest (2472 ms total)

[----------] 1 test from IsolationFlag/MemoryIsolatorTest
[ RUN      ] IsolationFlag/MemoryIsolatorTest.ROOT_MemUsage/0
[       OK ] IsolationFlag/MemoryIsolatorTest.ROOT_MemUsage/0 (2378 ms)
[----------] 1 test from IsolationFlag/MemoryIsolatorTest (2400 ms total)

[----------] Global test environment tear-down
[==========] 829 tests from 84 test cases ran. (328217 ms total)
[  PASSED  ] 819 tests.
[  FAILED  ] 10 tests, listed below:
[  FAILED  ] OfferOperationStatusUpdateManagerTest.UpdateAndAckNonTerminalUpdate
[  FAILED  ] OfferOperationStatusUpdateManagerTest.RecoverCheckpointedStream
[  FAILED  ] OfferOperationStatusUpdateManagerTest.RecoverEmptyFile
[  FAILED  ] OfferOperationStatusUpdateManagerTest.RecoverTerminatedStream
[  FAILED  ] OfferOperationStatusUpdateManagerTest.IgnoreDuplicateUpdate
[  FAILED  ] OfferOperationStatusUpdateManagerTest.IgnoreDuplicateUpdateAfterRecover
[  FAILED  ] OfferOperationStatusUpdateManagerTest.RejectDuplicateAck
[  FAILED  ] OfferOperationStatusUpdateManagerTest.RejectDuplicateAckAfterRecover
[  FAILED  ] OfferOperationStatusUpdateManagerTest.NonStrictRecoveryCorruptedFile
[  FAILED  ] SlaveTest.ResourceProviderPublishAll

10 FAILED TESTS
  YOU HAVE 201 DISABLED TESTS

```

- [mesos-tests-stderr.log](http://dcos-win.westus.cloudapp.azure.com/mesos-build/review/64548/logs/mesos-tests-stderr.log):

```
I1212 19:41:58.563194  9360 master.cpp:10146] Updating the state of task 13559cc4-0fdf-474c-9b0f-1fcb9b93ad97
of framework fa6537db-6e21-4f20-9b03-21663f4af419-0000 (latest state: TASK_KILLED, status
update state: TASK_KILLED)
I1212 19:41:58.563194  3712 slave.cpp:3400] Shutting down framework fa6537db-6e21-4f20-9b03-21663f4af419-0000
I1212 19:41:58.564195  3712 slave.cpp:6114] Shutting down executor '13559cc4-0fdf-474c-9b0f-1fcb9b93ad97'
of framework fa6537db-6e21-4f20-9b03-21663f4af419-0000 at executor(1)@10.3.1.11:51505
I1212 19:41:58.564195  3712 slave.cpp:909] Agent terminating
W1212 19:41:58.565196 I1212 19:41:57.891209  7284 exec.cpp:162] Version: 1.5.0
I1212 19:41:57.914206  8292 exec.cpp:237] Executor registered on agent fa6537db-6e21-4f20-9b03-21663f4af419-S0
I1212 19:41:57.918203  5032 executor.cpp:171] Received SUBSCRIBED event
I1212 19:41:57.922207  5032 executor.cpp:175] Subscribed executor on build-srv-03.zq4gs31qjdiunm1ryi1452nvnh.dx.internal.cloudapp.net
I1212 19:41:57.922207  5032 executor.cpp:171] Received LAUNCH event
I1212 19:41:57.927207  5032 executor.cpp:637] Starting task 13559cc4-0fdf-474c-9b0f-1fcb9b93ad97
I1212 19:41:58.003206  5032 executor.cpp:477] Running 'D:\DCOS\mesos\src\mesos-containerizer.exe
launch <POSSIBLY-SENSITIVE-DATA>'
I1212 19:41:58.537196  5032 executor.cpp:650] Forked command at 5180
I1212 19:41:58.565196  7944 exec.cpp:435] Executor asked to shutdown
I1212 19:41:58.566195  5032 executor.cpp:171] Received SHUTDOWN event
I1212 19:41:58.566195  5032 executor.cpp:747] Shutting down
I1212 19:41:58.566195  5032 executor.cpp:854] Sending SIGTERM to process tree at pid 5 3712
slave.cpp:3396] Ignoring shutdown framework fa6537db-6e21-4f20-9b03-21663f4af419-0000 because
it is terminating
I1212 19:41:58.565196  9360 master.cpp:10252] Removing task 13559cc4-0fdf-474c-9b0f-1fcb9b93ad97
with resources cpus(allocated: *):4; mem(allocated: *):2048; disk(allocated: *):1024; ports(allocated:
*):[31000-32000] of framework fa6537db-6e21-4f20-9b03-21663f4af419-0000 on agent fa6537db-6e21-4f20-9b03-21663f4af419-S0
at slave(326)@10.3.1.11:51483 (build-srv-03.zq4gs31qjdiunm1ryi1452nvnh.dx.internal.cloudapp.net)
I1212 19:41:58.568195  3712 containerizer.cpp:2328] Destroying container d6e1e150-3a67-41fe-88d9-0ea0f1684305
in RUNNING state
I1212 19:41:58.568195  9360 master.cpp:1305] Agent fa6537db-6e21-4f20-9b03-21663f4af419-S0
at slave(326)@10.3.1.11:51483 (build-srv-03.zq4gs31qjdiunm1ryi1452nvnh.dx.internal.cloudapp.net)
disconnected
I1212 19:41:58.568195  3712 containerizer.cpp:2930] Transitioning the state of container d6e1e150-3a67-41fe-88d9-0ea0f1684305
from RUNNING to DESTROYING
I1212 19:41:58.568195  9360 master.cpp:3364] Disconnecting agent fa6537db-6e21-4f20-9b03-21663f4af419-S0
at slave(326)@10.3.1.11:51483 (build-srv-03.zq4gs31qjdiunm1ryi1452nvnh.dx.internal.cloudapp.net)
I1212 19:41:58.569197  9360 master.cpp:3383] Deactivating agent fa6537db-6e21-4f20-9b03-21663f4af419-S0
at slave(326)@10.3.1.11:51483 (build-srv-03.zq4gs31qjdiunm1ryi1452nvnh.dx.internal.cloudapp.net)
I1212 19:41:58.568195  1996 hierarchical.cpp:344] Removed framework fa6537db-6e21-4f20-9b03-21663f4af419-0000
I1212 19:41:58.569197  3712 launcher.cpp:156] Asked to destroy container d6e1e150-3a67-41fe-88d9-0ea0f1684305
I1212 19:41:58.569197  1996 hierarchical.cpp:766] Agent fa6537db-6e21-4f20-9b03-21663f4af419-S0
deactivated
I1212 19:41:58.630345  9360 containerizer.cpp:2779] Container d6e1e150-3a67-41fe-88d9-0ea0f1684305
has exited
I1212 19:41:58.660349  2484 master.cpp:1147] Master terminating
I1212 19:41:58.662361  3032 hierarchical.cpp:609] Removed agent fa6537db-6e21-4f20-9b03-21663f4af419-S0
I1212 19:41:59.000350  8816 process.cpp:887] Failed to accept socket: future discarded
```

- Mesos Reviewbot Windows


On Dec. 12, 2017, 6:21 p.m., Greg Mann wrote:
> 
> -----------------------------------------------------------
> This is an automatically generated e-mail. To reply, visit:
> https://reviews.apache.org/r/64548/
> -----------------------------------------------------------
> 
> (Updated Dec. 12, 2017, 6:21 p.m.)
> 
> 
> Review request for mesos, Benjamin Bannier, Gaston Kleiman, Jie Yu, and Jan Schlicht.
> 
> 
> Bugs: MESOS-8195
>     https://issues.apache.org/jira/browse/MESOS-8195
> 
> 
> Repository: mesos
> 
> 
> Description
> -------
> 
> Made the agent respond to reconciliation requests for default resources.
> 
> 
> Diffs
> -----
> 
>   src/slave/slave.cpp 5869e73ca1c14c99e580da9d7375181da2073ec5 
> 
> 
> Diff: https://reviews.apache.org/r/64548/diff/1/
> 
> 
> Testing
> -------
> 
> make check
> 
> 
> Thanks,
> 
> Greg Mann
> 
>


Mime
  • Unnamed multipart/alternative (inline, None, 0 bytes)
View raw message