mesos-reviews mailing list archives

Site index · List index
Message view « Date » · « Thread »
Top « Date » · « Thread »
From Mesos Reviewbot Windows <revi...@mesos.apache.org>
Subject Re: Review Request 64546: Fixed a flaky test.
Date Tue, 12 Dec 2017 16:37:46 GMT

-----------------------------------------------------------
This is an automatically generated e-mail. To reply, visit:
https://reviews.apache.org/r/64546/#review193561
-----------------------------------------------------------



FAIL: Some Mesos tests failed.

Reviews applied: `['64546']`

Failed command: `D:\DCOS\mesos\src\mesos-tests.exe --verbose`

All the build artifacts available at: http://dcos-win.westus.cloudapp.azure.com/mesos-build/review/64546

Relevant logs:

- [mesos-tests-stdout.log](http://dcos-win.westus.cloudapp.azure.com/mesos-build/review/64546/logs/mesos-tests-stdout.log):

```

[----------] 1 test from IsolationFlag/CpuIsolatorTest
[ RUN      ] IsolationFlag/CpuIsolatorTest.ROOT_UserCpuUsage/0
[       OK ] IsolationFlag/CpuIsolatorTest.ROOT_UserCpuUsage/0 (2311 ms)
[----------] 1 test from IsolationFlag/CpuIsolatorTest (2332 ms total)

[----------] 1 test from IsolationFlag/MemoryIsolatorTest
[ RUN      ] IsolationFlag/MemoryIsolatorTest.ROOT_MemUsage/0
[       OK ] IsolationFlag/MemoryIsolatorTest.ROOT_MemUsage/0 (2253 ms)
[----------] 1 test from IsolationFlag/MemoryIsolatorTest (2276 ms total)

[----------] Global test environment tear-down
[==========] 829 tests from 84 test cases ran. (304197 ms total)
[  PASSED  ] 819 tests.
[  FAILED  ] 10 tests, listed below:
[  FAILED  ] OfferOperationStatusUpdateManagerTest.UpdateAndAckNonTerminalUpdate
[  FAILED  ] OfferOperationStatusUpdateManagerTest.RecoverCheckpointedStream
[  FAILED  ] OfferOperationStatusUpdateManagerTest.RecoverEmptyFile
[  FAILED  ] OfferOperationStatusUpdateManagerTest.RecoverTerminatedStream
[  FAILED  ] OfferOperationStatusUpdateManagerTest.IgnoreDuplicateUpdate
[  FAILED  ] OfferOperationStatusUpdateManagerTest.IgnoreDuplicateUpdateAfterRecover
[  FAILED  ] OfferOperationStatusUpdateManagerTest.RejectDuplicateAck
[  FAILED  ] OfferOperationStatusUpdateManagerTest.RejectDuplicateAckAfterRecover
[  FAILED  ] OfferOperationStatusUpdateManagerTest.NonStrictRecoveryCorruptedFile
[  FAILED  ] SlaveTest.ResourceProviderPublishAll

10 FAILED TESTS
  YOU HAVE 204 DISABLED TESTS

```

- [mesos-tests-stderr.log](http://dcos-win.westus.cloudapp.azure.com/mesos-build/review/64546/logs/mesos-tests-stderr.log):

```
I1212 16:37:27.830670  3076 executor.cpp:171] Received SUBSCRIBED event
I1212 16:37:27.834671  3076 executor.cpp:175] Subscribed executor on build-srv-04.zq4gs31qjdiunm1ryi1452nvnh.dx.internal.cloudapp.net
I1212 16:37:27.834671  3076 executor.cpp:171] Received LAUNCH event
I1212 16:37:27.838670  3076 executor.cpp:637] Starting task 2768344d-1ac0-45e6-8bc2-3905daa560f4
I1212 16:37:27.911669  3076 executor.cpp:477] Running 'D:\DCOS\mesos\src\mesos-containerizer.exe
launch <POSSIBLY-SENSITIVE-DATA>'
I1212 16:37:28.450675  3076 executor.cpp:650] Forked command at 5056
I1212 16:37:28.476675  8596 exec.cpp:435] Executor asked to shutdown
I1212 16:37:28.477675  4156 executor.cpp:171] Received SHUTDOWN event
I1212 16:37:28.477675  4156 executor.cpp:747] Shutting down
I1212 16:37:28.477675  4156 executor.cpp:854] Sending SIGTERM to process tree at pid 54e43-af0a-2d48f2bae027@10.3.1.5:62719
I1212 16:37:28.474678  8848 hierarchical.cpp:405] Deactivated framework 62af06ef-1d7c-4889-9d83-14175ba00a76-0000
I1212 16:37:28.475675  1608 master.cpp:10114] Updating the state of task 2768344d-1ac0-45e6-8bc2-3905daa560f4
of framework 62af06ef-1d7c-4889-9d83-14175ba00a76-0000 (latest state: TASK_KILLED, status
update state: TASK_KILLED)
I1212 16:37:28.475675   992 slave.cpp:3400] Shutting down framework 62af06ef-1d7c-4889-9d83-14175ba00a76-0000
I1212 16:37:28.475675   992 slave.cpp:6091] Shutting down executor '2768344d-1ac0-45e6-8bc2-3905daa560f4'
of framework 62af06ef-1d7c-4889-9d83-14175ba00a76-0000 at executor(1)@10.3.1.5:62740
I1212 16:37:28.475675   992 slave.cpp:909] Agent terminating
W1212 16:37:28.476675   992 slave.cpp:3396] Ignoring shutdown framework 62af06ef-1d7c-4889-9d83-14175ba00a76-0000
because it is terminating
I1212 16:37:28.477675  1608 master.cpp:10220] Removing task 2768344d-1ac0-45e6-8bc2-3905daa560f4
with resources cpus(allocated: *):4; mem(allocated: *):2048; disk(allocated: *):1024; ports(allocated:
*):[31000-32000] of framework 62af06ef-1d7c-4889-9d83-14175ba00a76-0000 on agent 62af06ef-1d7c-4889-9d83-14175ba00a76-S0
at slave(326)@10.3.1.5:62719 (build-srv-04.zq4gs31qjdiunm1ryi1452nvnh.dx.internal.cloudapp.net)
I1212 16:37:28.478704   992 containerizer.cpp:2328] Destroying container d662026c-6e79-4319-b016-f1c836a630a1
in RUNNING state
I1212 16:37:28.479676   992 containerizer.cpp:2930] Transitioning the state of container d662026c-6e79-4319-b016-f1c836a630a1
from RUNNING to DESTROYING
I1212 16:37:28.479676   992 launcher.cpp:156] Asked to destroy container d662026c-6e79-4319-b016-f1c836a630a1
I1212 16:37:28.480675  1608 master.cpp:1305] Agent 62af06ef-1d7c-4889-9d83-14175ba00a76-S0
at slave(326)@10.3.1.5:62719 (build-srv-04.zq4gs31qjdiunm1ryi1452nvnh.dx.internal.cloudapp.net)
disconnected
I1212 16:37:28.480675  1608 master.cpp:3364] Disconnecting agent 62af06ef-1d7c-4889-9d83-14175ba00a76-S0
at slave(326)@10.3.1.5:62719 (build-srv-04.zq4gs31qjdiunm1ryi1452nvnh.dx.internal.cloudapp.net)
I1212 16:37:28.480675  1408 hierarchical.cpp:344] Removed framework 62af06ef-1d7c-4889-9d83-14175ba00a76-0000
I1212 16:37:28.480675  1608 master.cpp:3383] Deactivating agent 62af06ef-1d7c-4889-9d83-14175ba00a76-S0
at slave(326)@10.3.1.5:62719 (build-srv-04.zq4gs31qjdiunm1ryi1452nvnh.dx.internal.cloudapp.net)
I1212 16:37:28.481675  8536 hierarchical.cpp:766] Agent 62af06ef-1d7c-4889-9d83-14175ba00a76-S0
deactivated
I1212 16:37:28.503743  8848 containerizer.cpp:2779] Container d662026c-6e79-4319-b016-f1c836a630a1
has exited
I1212 16:37:28.531785  3264 master.cpp:1147] Master terminating
I1212 16:37:28.533778  8536 hierarchical.cpp:609] Removed agent 62af06ef-1d7c-4889-9d83-14175ba00a76-S0
I1212 16:37:28.841305  2284 process.cpp:887] Failed to accept socket: future discarded
```

- Mesos Reviewbot Windows


On Dec. 12, 2017, 5:15 p.m., Jan Schlicht wrote:
> 
> -----------------------------------------------------------
> This is an automatically generated e-mail. To reply, visit:
> https://reviews.apache.org/r/64546/
> -----------------------------------------------------------
> 
> (Updated Dec. 12, 2017, 5:15 p.m.)
> 
> 
> Review request for mesos, Alexander Rukletsov, Benjamin Bannier, and Jie Yu.
> 
> 
> Bugs: MESOS-8315
>     https://issues.apache.org/jira/browse/MESOS-8315
> 
> 
> Repository: mesos
> 
> 
> Description
> -------
> 
> Callbacks of already invalidated instances could be called in
> 'ResubscribeResourceProvider' when simulating a resource provider
> restart. This has been resolved by not only restarting a resource
> provider's driver, but creating a new 'MockResourceProvider' instance.
> 
> 
> Diffs
> -----
> 
>   src/tests/resource_provider_manager_tests.cpp e37a53ac6a03e2ea58dd6580fc8a399a1398d950

> 
> 
> Diff: https://reviews.apache.org/r/64546/diff/1/
> 
> 
> Testing
> -------
> 
> make check
> 
> src/mesos-tests --gtest_filter=*ResourceProviderManagerHttpApiTest.ResubscribeResourceProvider*
--gtest_repeat=1000 --gtest_break_on_failure (with 'stress' running in the background)
> 
> 
> Thanks,
> 
> Jan Schlicht
> 
>


Mime
  • Unnamed multipart/alternative (inline, None, 0 bytes)
View raw message