mesos-reviews mailing list archives

Site index · List index
Message view « Date » · « Thread »
Top « Date » · « Thread »
From Mesos Reviewbot Windows <revi...@mesos.apache.org>
Subject Re: Review Request 64543: Exposed resource provider information in master 'GET_AGENTS' response.
Date Tue, 12 Dec 2017 15:40:41 GMT

-----------------------------------------------------------
This is an automatically generated e-mail. To reply, visit:
https://reviews.apache.org/r/64543/#review193545
-----------------------------------------------------------



FAIL: Some Mesos tests failed.

Reviews applied: `['64543']`

Failed command: `D:\DCOS\mesos\src\mesos-tests.exe --verbose`

All the build artifacts available at: http://dcos-win.westus.cloudapp.azure.com/mesos-build/review/64543

Relevant logs:

- [mesos-tests-stdout.log](http://dcos-win.westus.cloudapp.azure.com/mesos-build/review/64543/logs/mesos-tests-stdout.log):

```

[----------] 1 test from IsolationFlag/CpuIsolatorTest
[ RUN      ] IsolationFlag/CpuIsolatorTest.ROOT_UserCpuUsage/0
[       OK ] IsolationFlag/CpuIsolatorTest.ROOT_UserCpuUsage/0 (2369 ms)
[----------] 1 test from IsolationFlag/CpuIsolatorTest (2396 ms total)

[----------] 1 test from IsolationFlag/MemoryIsolatorTest
[ RUN      ] IsolationFlag/MemoryIsolatorTest.ROOT_MemUsage/0
[       OK ] IsolationFlag/MemoryIsolatorTest.ROOT_MemUsage/0 (2480 ms)
[----------] 1 test from IsolationFlag/MemoryIsolatorTest (2505 ms total)

[----------] Global test environment tear-down
[==========] 829 tests from 84 test cases ran. (319985 ms total)
[  PASSED  ] 819 tests.
[  FAILED  ] 10 tests, listed below:
[  FAILED  ] OfferOperationStatusUpdateManagerTest.UpdateAndAckNonTerminalUpdate
[  FAILED  ] OfferOperationStatusUpdateManagerTest.RecoverCheckpointedStream
[  FAILED  ] OfferOperationStatusUpdateManagerTest.RecoverEmptyFile
[  FAILED  ] OfferOperationStatusUpdateManagerTest.RecoverTerminatedStream
[  FAILED  ] OfferOperationStatusUpdateManagerTest.IgnoreDuplicateUpdate
[  FAILED  ] OfferOperationStatusUpdateManagerTest.IgnoreDuplicateUpdateAfterRecover
[  FAILED  ] OfferOperationStatusUpdateManagerTest.RejectDuplicateAck
[  FAILED  ] OfferOperationStatusUpdateManagerTest.RejectDuplicateAckAfterRecover
[  FAILED  ] OfferOperationStatusUpdateManagerTest.NonStrictRecoveryCorruptedFile
[  FAILED  ] SlaveTest.ResourceProviderPublishAll

10 FAILED TESTS
  YOU HAVE 201 DISABLED TESTS

```

- [mesos-tests-stderr.log](http://dcos-win.westus.cloudapp.azure.com/mesos-build/review/64543/logs/mesos-tests-stderr.log):

```
I1212 15:40:19.733963  7092 master.cpp:10114] Updating the state of task 031455f5-28e6-4b0c-8ece-02f36d5d548d
of framework 28b78b9a-209d-4a82-a559-7f9671fef77e-0000 (latest state: TASK_KILLED, status
update state: TASK_KILLED)
I1212 15:40:19.733963   448 slave.cpp:3400] Shutting down framework 28b78b9a-209d-4a82-a559-7f9671fef77e-0000
I1212 15:40:19.733963   448 slave.cpp:6091] Shutting down executor '031455f5-28e6-4b0c-8ece-02f36d5d548d'
of framework 28b78b9a-209d-4a82-a559-7f9671fef77e-0000 at executor(1)@10.3.1.11:63951
I1212 15:40:19.734962   448 slave.cpp:909] Agent terminating
W1212 15:40:19.734962   448 slave.cpp:3396] Ignoring shutdown framework 28b78b9a-209d-4a82-a559-7f9671fef77e-0000
because it is terminating
I1212 15:40:19.735962  7092 master.cpp:10220] Removing taskI1212 15:40:19.018965  9104 exec.cpp:162]
Version: 1.5.0
I1212 15:40:19.042210  8012 exec.cpp:237] Executor registered on agent 28b78b9a-209d-4a82-a559-7f9671fef77e-S0
I1212 15:40:19.043965  1108 executor.cpp:171] Received SUBSCRIBED event
I1212 15:40:19.048961  1108 executor.cpp:175] Subscribed executor on build-srv-03.zq4gs31qjdiunm1ryi1452nvnh.dx.internal.cloudapp.net
I1212 15:40:19.049960  1108 executor.cpp:171] Received LAUNCH event
I1212 15:40:19.053961  1108 executor.cpp:637] Starting task 031455f5-28e6-4b0c-8ece-02f36d5d548d
I1212 15:40:19.129961  1108 executor.cpp:477] Running 'D:\DCOS\mesos\src\mesos-containerizer.exe
launch <POSSIBLY-SENSITIVE-DATA>'
I1212 15:40:19.702962  1108 executor.cpp:650] Forked command at 3744
I1212 15:40:19.735962  9252 exec.cpp:435] Executor asked to shutdown
I1212 15:40:19.735962  1108 executor.cpp:171] Received SHUTDOWN event
I1212 15:40:19.735962  1108 executor.cpp:747] Shutting down
I1212 15:40:19.735962  1108 executor.cpp:854] Sending SIGTERM to process tree at pid 3 031455f5-28e6-4b0c-8ece-02f36d5d548d
with resources cpus(allocated: *):4; mem(allocated: *):2048; disk(allocated: *):1024; ports(allocated:
*):[31000-32000] of framework 28b78b9a-209d-4a82-a559-7f9671fef77e-0000 on agent 28b78b9a-209d-4a82-a559-7f9671fef77e-S0
at slave(326)@10.3.1.11:63930 (build-srv-03.zq4gs31qjdiunm1ryi1452nvnh.dx.internal.cloudapp.net)
I1212 15:40:19.737962  8644 containerizer.cpp:2328] Destroying container aa3f40cf-910d-4bde-bd14-c53c8eb38d1a
in RUNNING state
I1212 15:40:19.737962  8644 containerizer.cpp:2930] Transitioning the state of container aa3f40cf-910d-4bde-bd14-c53c8eb38d1a
from RUNNING to DESTROYING
I1212 15:40:19.738965  7092 master.cpp:1305] Agent 28b78b9a-209d-4a82-a559-7f9671fef77e-S0
at slave(326)@10.3.1.11:63930 (build-srv-03.zq4gs31qjdiunm1ryi1452nvnh.dx.internal.cloudapp.net)
disconnected
I1212 15:40:19.738965  7092 master.cpp:3364] Disconnecting agent 28b78b9a-209d-4a82-a559-7f9671fef77e-S0
at slave(326)@10.3.1.11:63930 (build-srv-03.zq4gs31qjdiunm1ryi1452nvnh.dx.internal.cloudapp.net)
I1212 15:40:19.738965  8644 launcher.cpp:156] Asked to destroy container aa3f40cf-910d-4bde-bd14-c53c8eb38d1a
I1212 15:40:19.738965  6900 hierarchical.cpp:344] Removed framework 28b78b9a-209d-4a82-a559-7f9671fef77e-0000
I1212 15:40:19.739965  7092 master.cpp:3383] Deactivating agent 28b78b9a-209d-4a82-a559-7f9671fef77e-S0
at slave(326)@10.3.1.11:63930 (build-srv-03.zq4gs31qjdiunm1ryi1452nvnh.dx.internal.cloudapp.net)
I1212 15:40:19.739965  3452 hierarchical.cpp:766] Agent 28b78b9a-209d-4a82-a559-7f9671fef77e-S0
deactivated
I1212 15:40:19.838073 10152 containerizer.cpp:2779] Container aa3f40cf-910d-4bde-bd14-c53c8eb38d1a
has exited
I1212 15:40:19.867084  8392 master.cpp:1147] Master terminating
I1212 15:40:19.869083   448 hierarchical.cpp:609] Removed agent 28b78b9a-209d-4a82-a559-7f9671fef77e-S0
I1212 15:40:20.274080  9384 process.cpp:887] Failed to accept socket: future discarded
```

- Mesos Reviewbot Windows


On Dec. 12, 2017, 9:38 a.m., Benjamin Bannier wrote:
> 
> -----------------------------------------------------------
> This is an automatically generated e-mail. To reply, visit:
> https://reviews.apache.org/r/64543/
> -----------------------------------------------------------
> 
> (Updated Dec. 12, 2017, 9:38 a.m.)
> 
> 
> Review request for mesos, Jie Yu and Jan Schlicht.
> 
> 
> Repository: mesos
> 
> 
> Description
> -------
> 
> This patch extends the master's 'GET_AGENTS' response to include local
> resource provider information. For now only the 'ResourceProviderInfo'
> are shown.
> 
> 
> Diffs
> -----
> 
>   include/mesos/master/master.proto 87083beec66a9f57803bfb0735188fcdedafaa87 
>   include/mesos/v1/master/master.proto ea04b8f1e28e1c20ac803f8f1610cc1e765ddd9d 
>   src/master/http.cpp bb040ced65495cfe78b67ca7258499c16ac5d8a1 
>   src/tests/api_tests.cpp 3372849cb2aa070df6b2262b57baa0fab628e11d 
> 
> 
> Diff: https://reviews.apache.org/r/64543/diff/1/
> 
> 
> Testing
> -------
> 
> 
> Thanks,
> 
> Benjamin Bannier
> 
>


Mime
  • Unnamed multipart/alternative (inline, None, 0 bytes)
View raw message