mesos-reviews mailing list archives

Site index · List index
Message view « Date » · « Thread »
Top « Date » · « Thread »
From Mesos Reviewbot Windows <revi...@mesos.apache.org>
Subject Re: Review Request 64098: Send status updates when agent re-registers.
Date Tue, 12 Dec 2017 15:37:07 GMT

-----------------------------------------------------------
This is an automatically generated e-mail. To reply, visit:
https://reviews.apache.org/r/64098/#review193544
-----------------------------------------------------------



FAIL: Some Mesos tests failed.

Reviews applied: `['64250', '64098']`

Failed command: `D:\DCOS\mesos\src\mesos-tests.exe --verbose`

All the build artifacts available at: http://dcos-win.westus.cloudapp.azure.com/mesos-build/review/64098

Relevant logs:

- [mesos-tests-stdout.log](http://dcos-win.westus.cloudapp.azure.com/mesos-build/review/64098/logs/mesos-tests-stdout.log):

```

[----------] 1 test from IsolationFlag/CpuIsolatorTest
[ RUN      ] IsolationFlag/CpuIsolatorTest.ROOT_UserCpuUsage/0
[       OK ] IsolationFlag/CpuIsolatorTest.ROOT_UserCpuUsage/0 (2284 ms)
[----------] 1 test from IsolationFlag/CpuIsolatorTest (2306 ms total)

[----------] 1 test from IsolationFlag/MemoryIsolatorTest
[ RUN      ] IsolationFlag/MemoryIsolatorTest.ROOT_MemUsage/0
[       OK ] IsolationFlag/MemoryIsolatorTest.ROOT_MemUsage/0 (2265 ms)
[----------] 1 test from IsolationFlag/MemoryIsolatorTest (2287 ms total)

[----------] Global test environment tear-down
[==========] 829 tests from 84 test cases ran. (305398 ms total)
[  PASSED  ] 819 tests.
[  FAILED  ] 10 tests, listed below:
[  FAILED  ] OfferOperationStatusUpdateManagerTest.UpdateAndAckNonTerminalUpdate
[  FAILED  ] OfferOperationStatusUpdateManagerTest.RecoverCheckpointedStream
[  FAILED  ] OfferOperationStatusUpdateManagerTest.RecoverEmptyFile
[  FAILED  ] OfferOperationStatusUpdateManagerTest.RecoverTerminatedStream
[  FAILED  ] OfferOperationStatusUpdateManagerTest.IgnoreDuplicateUpdate
[  FAILED  ] OfferOperationStatusUpdateManagerTest.IgnoreDuplicateUpdateAfterRecover
[  FAILED  ] OfferOperationStatusUpdateManagerTest.RejectDuplicateAck
[  FAILED  ] OfferOperationStatusUpdateManagerTest.RejectDuplicateAckAfterRecover
[  FAILED  ] OfferOperationStatusUpdateManagerTest.NonStrictRecoveryCorruptedFile
[  FAILED  ] SlaveTest.ResourceProviderPublishAll

10 FAILED TESTS
  YOU HAVE 204 DISABLED TESTS

```

- [mesos-tests-stderr.log](http://dcos-win.westus.cloudapp.azure.com/mesos-build/review/64098/logs/mesos-tests-stderr.log):

```
I1212 15:36:49.166775  6504 master.cpp:10149] Updating the state of task 12db25fd-0b6f-4f66-9b84-e1a1c13e46ff
of framework d72ff96e-44f0-4c60-bf3f-16dff914edd0-0000 (latest state: TASK_KILLED, status
update state: TASK_KILLED)
I1212 15:36:49.1I1212 15:36:48.500752  7276 exec.cpp:162] Version: 1.5.0
I1212 15:36:48.523741   508 exec.cpp:237] Executor registered on agent d72ff96e-44f0-4c60-bf3f-16dff914edd0-S0
I1212 15:36:48.525737  4216 executor.cpp:171] Received SUBSCRIBED event
I1212 15:36:48.529757  4216 executor.cpp:175] Subscribed executor on build-srv-04.zq4gs31qjdiunm1ryi1452nvnh.dx.internal.cloudapp.net
I1212 15:36:48.530753  4216 executor.cpp:171] Received LAUNCH event
I1212 15:36:48.533756  4216 executor.cpp:637] Starting task 12db25fd-0b6f-4f66-9b84-e1a1c13e46ff
I1212 15:36:48.606755  4216 executor.cpp:477] Running 'D:\DCOS\mesos\src\mesos-containerizer.exe
launch <POSSIBLY-SENSITIVE-DATA>'
I1212 15:36:49.136749  4216 executor.cpp:650] Forked command at 6088
I1212 15:36:49.168748  7684 exec.cpp:435] Executor asked to shutdown
I1212 15:36:49.169749  8940 executor.cpp:171] Received SHUTDOWN event
I1212 15:36:49.169749  8940 executor.cpp:747] Shutting down
I1212 15:36:49.169749  8940 executor.cpp:854] Sending SIGTERM to process tree at pid 666775
 5788 slave.cpp:3400] Shutting down framework d72ff96e-44f0-4c60-bf3f-16dff914edd0-0000
I1212 15:36:49.167755  5788 slave.cpp:6091] Shutting down executor '12db25fd-0b6f-4f66-9b84-e1a1c13e46ff'
of framework d72ff96e-44f0-4c60-bf3f-16dff914edd0-0000 at executor(1)@10.3.1.5:60853
I1212 15:36:49.168748  6504 master.cpp:10255] Removing task 12db25fd-0b6f-4f66-9b84-e1a1c13e46ff
with resources cpus(allocated: *):4; mem(allocated: *):2048; disk(allocated: *):1024; ports(allocated:
*):[31000-32000] of framework d72ff96e-44f0-4c60-bf3f-16dff914edd0-0000 on agent d72ff96e-44f0-4c60-bf3f-16dff914edd0-S0
at slave(326)@10.3.1.5:60832 (build-srv-04.zq4gs31qjdiunm1ryi1452nvnh.dx.internal.cloudapp.net)
I1212 15:36:49.169749  5532 slave.cpp:909] Agent terminating
W1212 15:36:49.169749  5532 slave.cpp:3396] Ignoring shutdown framework d72ff96e-44f0-4c60-bf3f-16dff914edd0-0000
because it is terminating
I1212 15:36:49.170748  6504 master.cpp:1305] Agent d72ff96e-44f0-4c60-bf3f-16dff914edd0-S0
at slave(326)@10.3.1.5:60832 (build-srv-04.zq4gs31qjdiunm1ryi1452nvnh.dx.internal.cloudapp.net)
disconnected
I1212 15:36:49.171747  6504 master.cpp:3364] Disconnecting agent d72ff96e-44f0-4c60-bf3f-16dff914edd0-S0
at slave(326)@10.3.1.5:60832 (build-srv-04.zq4gs31qjdiunm1ryi1452nvnh.dx.internal.cloudapp.net)
I1212 15:36:49.171747  6504 master.cpp:3383] Deactivating agent d72ff96e-44f0-4c60-bf3f-16dff914edd0-S0
at slave(326)@10.3.1.5:60832 (build-srv-04.zq4gs31qjdiunm1ryi1452nvnh.dx.internal.cloudapp.net)
I1212 15:36:49.172749  6188 hierarchical.cpp:344] Removed framework d72ff96e-44f0-4c60-bf3f-16dff914edd0-0000
I1212 15:36:49.172749  5788 containerizer.cpp:2328] Destroying container 73931559-14c2-4592-be81-e3b011a3a238
in RUNNING state
I1212 15:36:49.172749  5788 containerizer.cpp:2930] Transitioning the state of container 73931559-14c2-4592-be81-e3b011a3a238
from RUNNING to DESTROYING
I1212 15:36:49.172749  6188 hierarchical.cpp:766] Agent d72ff96e-44f0-4c60-bf3f-16dff914edd0-S0
deactivated
I1212 15:36:49.173789  5788 launcher.cpp:156] Asked to destroy container 73931559-14c2-4592-be81-e3b011a3a238
I1212 15:36:49.236873  5532 containerizer.cpp:2779] Container 73931559-14c2-4592-be81-e3b011a3a238
has exited
I1212 15:36:49.263880  1432 master.cpp:1147] Master terminating
I1212 15:36:49.265879  1960 hierarchical.cpp:609] Removed agent d72ff96e-44f0-4c60-bf3f-16dff914edd0-S0
I1212 15:36:49.553886   684 process.cpp:887] Failed to accept socket: future discarded
```

- Mesos Reviewbot Windows


On Dec. 12, 2017, 4:54 a.m., Megha Sharma wrote:
> 
> -----------------------------------------------------------
> This is an automatically generated e-mail. To reply, visit:
> https://reviews.apache.org/r/64098/
> -----------------------------------------------------------
> 
> (Updated Dec. 12, 2017, 4:54 a.m.)
> 
> 
> Review request for mesos, Ilya Pronin, James Peach, and Jiang Yan Xu.
> 
> 
> Bugs: MESOS-6406
>     https://issues.apache.org/jira/browse/MESOS-6406
> 
> 
> Repository: mesos
> 
> 
> Description
> -------
> 
> Master will send task status updates to frameworks when an agent
> which has been previously removed by the master for being unreachable
> or is unknown to the master due to the garbage collection of
> the unreachable and gone agents in the registry re-registers.
> 
> 
> Diffs
> -----
> 
>   src/master/master.cpp b10d0341276090bfa70aaa4fd6317a560e3334ea 
>   src/tests/master_allocator_tests.cpp 10de6f0104a6a93ff5037d7e2ab5cf21d57fbec8 
>   src/tests/master_tests.cpp 7b087675200fe0ca69319b715997700a91d9f6b2 
>   src/tests/partition_tests.cpp 54ccf783682e7e6db0847b9a6313489b7f8181f8 
>   src/tests/persistent_volume_tests.cpp f255382af957cfa66f5efaffcaf1082b83b35e58 
>   src/tests/slave_recovery_tests.cpp 253b0fc2ff7ec1f00937d42636151553c46d5175 
>   src/tests/upgrade_tests.cpp 0efaa586153564b20f7884023946a11635425ee4 
> 
> 
> Diff: https://reviews.apache.org/r/64098/diff/15/
> 
> 
> Testing
> -------
> 
> with make check
> 
> 
> Thanks,
> 
> Megha Sharma
> 
>


Mime
  • Unnamed multipart/alternative (inline, None, 0 bytes)
View raw message