mesos-reviews mailing list archives

Site index · List index
Message view « Date » · « Thread »
Top « Date » · « Thread »
From Mesos Reviewbot Windows <revi...@mesos.apache.org>
Subject Re: Review Request 64168: Introduced a 'UUID' type.
Date Tue, 12 Dec 2017 14:48:07 GMT

-----------------------------------------------------------
This is an automatically generated e-mail. To reply, visit:
https://reviews.apache.org/r/64168/#review193541
-----------------------------------------------------------



FAIL: Some Mesos tests failed.

Reviews applied: `['64381', '64380', '64168']`

Failed command: `D:\DCOS\mesos\src\mesos-tests.exe --verbose`

All the build artifacts available at: http://dcos-win.westus.cloudapp.azure.com/mesos-build/review/64168

Relevant logs:

- [mesos-tests-stdout.log](http://dcos-win.westus.cloudapp.azure.com/mesos-build/review/64168/logs/mesos-tests-stdout.log):

```

[----------] 1 test from IsolationFlag/CpuIsolatorTest
[ RUN      ] IsolationFlag/CpuIsolatorTest.ROOT_UserCpuUsage/0
[       OK ] IsolationFlag/CpuIsolatorTest.ROOT_UserCpuUsage/0 (2313 ms)
[----------] 1 test from IsolationFlag/CpuIsolatorTest (2347 ms total)

[----------] 1 test from IsolationFlag/MemoryIsolatorTest
[ RUN      ] IsolationFlag/MemoryIsolatorTest.ROOT_MemUsage/0
[       OK ] IsolationFlag/MemoryIsolatorTest.ROOT_MemUsage/0 (2252 ms)
[----------] 1 test from IsolationFlag/MemoryIsolatorTest (2274 ms total)

[----------] Global test environment tear-down
[==========] 829 tests from 84 test cases ran. (303365 ms total)
[  PASSED  ] 819 tests.
[  FAILED  ] 10 tests, listed below:
[  FAILED  ] OfferOperationStatusUpdateManagerTest.UpdateAndAckNonTerminalUpdate
[  FAILED  ] OfferOperationStatusUpdateManagerTest.RecoverCheckpointedStream
[  FAILED  ] OfferOperationStatusUpdateManagerTest.RecoverEmptyFile
[  FAILED  ] OfferOperationStatusUpdateManagerTest.RecoverTerminatedStream
[  FAILED  ] OfferOperationStatusUpdateManagerTest.IgnoreDuplicateUpdate
[  FAILED  ] OfferOperationStatusUpdateManagerTest.IgnoreDuplicateUpdateAfterRecover
[  FAILED  ] OfferOperationStatusUpdateManagerTest.RejectDuplicateAck
[  FAILED  ] OfferOperationStatusUpdateManagerTest.RejectDuplicateAckAfterRecover
[  FAILED  ] OfferOperationStatusUpdateManagerTest.NonStrictRecoveryCorruptedFile
[  FAILED  ] SlaveTest.ResourceProviderPublishAll

10 FAILED TESTS
  YOU HAVE 204 DISABLED TESTS

```

- [mesos-tests-stderr.log](http://dcos-win.westus.cloudapp.azure.com/mesos-build/review/64168/logs/mesos-tests-stderr.log):

```
I1212 14:47:47.116789  3380 master.cpp:10119] Updating the state of task 67b5decf-d502-4f58-a8e6-7455963fffc6
of framework f3cba6e6-efb2-41f5-8ff7-e113306e5246-0000 (latest state: TASK_KILLED, status
update state: TASK_KILLED)
I1212 14:47:47.116789  6264 slave.cpp:3401] Shutting down framework f3cba6e6-efb2-41f5-8ff7-e113306e5246-0000
I1212 14:47:47.117807  6264 slave.cpp:6093] Shutting down executor '67b5decf-d502-4f58-a8e6-7455963fffc6'
of framework f3cba6e6-efb2-41f5-8ff7-e113306e5246-0000 at executor(1)@10.3.1.5:58993
I1212 14:47:47.117807  6264 slave.cpp:909] Agent terminating
W1212 14:47:47.118788  6264 slave.cpp:3397I1212 14:47:46.458775  1940 exec.cpp:162] Version:
1.5.0
I1212 14:47:46.481771  7744 exec.cpp:237] Executor registered on agent f3cba6e6-efb2-41f5-8ff7-e113306e5246-S0
I1212 14:47:46.484752   940 executor.cpp:171] Received SUBSCRIBED event
I1212 14:47:46.488776   940 executor.cpp:175] Subscribed executor on build-srv-04.zq4gs31qjdiunm1ryi1452nvnh.dx.internal.cloudapp.net
I1212 14:47:46.488776   940 executor.cpp:171] Received LAUNCH event
I1212 14:47:46.492776   940 executor.cpp:638] Starting task 67b5decf-d502-4f58-a8e6-7455963fffc6
I1212 14:47:46.566776   940 executor.cpp:478] Running 'D:\DCOS\mesos\src\mesos-containerizer.exe
launch <POSSIBLY-SENSITIVE-DATA>'
I1212 14:47:47.093786   940 executor.cpp:651] Forked command at 3228
I1212 14:47:47.118788  8020 exec.cpp:435] Executor asked to shutdown
I1212 14:47:47.118788  2636 executor.cpp:171] Received SHUTDOWN event
I1212 14:47:47.119788  2636 executor.cpp:748] Shutting down
I1212 14:47:47.119788  2636 executor.cpp:855] Sending SIGTERM to process tree at pid 3] Ignoring
shutdown framework f3cba6e6-efb2-41f5-8ff7-e113306e5246-0000 because it is terminating
I1212 14:47:47.119788  3380 master.cpp:10225] Removing task 67b5decf-d502-4f58-a8e6-7455963fffc6
with resources cpus(allocated: *):4; mem(allocated: *):2048; disk(allocated: *):1024; ports(allocated:
*):[31000-32000] of framework f3cba6e6-efb2-41f5-8ff7-e113306e5246-0000 on agent f3cba6e6-efb2-41f5-8ff7-e113306e5246-S0
at slave(326)@10.3.1.5:58972 (build-srv-04.zq4gs31qjdiunm1ryi1452nvnh.dx.internal.cloudapp.net)
I1212 14:47:47.121788  3144 containerizer.cpp:2328] Destroying container f2fdea5d-fde8-4d70-a6b6-8cf9ffdd282b
in RUNNING state
I1212 14:47:47.121788  3144 containerizer.cpp:2930] Transitioning the state of container f2fdea5d-fde8-4d70-a6b6-8cf9ffdd282b
from RUNNING to DESTROYING
I1212 14:47:47.121788  3380 master.cpp:1305] Agent f3cba6e6-efb2-41f5-8ff7-e113306e5246-S0
at slave(326)@10.3.1.5:58972 (build-srv-04.zq4gs31qjdiunm1ryi1452nvnh.dx.internal.cloudapp.net)
disconnected
I1212 14:47:47.121788  3380 master.cpp:3364] Disconnecting agent f3cba6e6-efb2-41f5-8ff7-e113306e5246-S0
at slave(326)@10.3.1.5:58972 (build-srv-04.zq4gs31qjdiunm1ryi1452nvnh.dx.internal.cloudapp.net)
I1212 14:47:47.122788  8784 hierarchical.cpp:344] Removed framework f3cba6e6-efb2-41f5-8ff7-e113306e5246-0000
I1212 14:47:47.122788  3144 launcher.cpp:156] Asked to destroy container f2fdea5d-fde8-4d70-a6b6-8cf9ffdd282b
I1212 14:47:47.122788  3380 master.cpp:3383] Deactivating agent f3cba6e6-efb2-41f5-8ff7-e113306e5246-S0
at slave(326)@10.3.1.5:58972 (build-srv-04.zq4gs31qjdiunm1ryi1452nvnh.dx.internal.cloudapp.net)
I1212 14:47:47.122788  4108 hierarchical.cpp:766] Agent f3cba6e6-efb2-41f5-8ff7-e113306e5246-S0
deactivated
I1212 14:47:47.161919  3380 containerizer.cpp:2779] Container f2fdea5d-fde8-4d70-a6b6-8cf9ffdd282b
has exited
I1212 14:47:47.188935  6900 master.cpp:1147] Master terminating
I1212 14:47:47.190934  6372 hierarchical.cpp:609] Removed agent f3cba6e6-efb2-41f5-8ff7-e113306e5246-S0
I1212 14:47:47.481204  2504 process.cpp:887] Failed to accept socket: future discarded
```

- Mesos Reviewbot Windows


On Dec. 12, 2017, 2:20 p.m., Jan Schlicht wrote:
> 
> -----------------------------------------------------------
> This is an automatically generated e-mail. To reply, visit:
> https://reviews.apache.org/r/64168/
> -----------------------------------------------------------
> 
> (Updated Dec. 12, 2017, 2:20 p.m.)
> 
> 
> Review request for mesos, Benjamin Bannier and Jie Yu.
> 
> 
> Bugs: MESOS-8309
>     https://issues.apache.org/jira/browse/MESOS-8309
> 
> 
> Repository: mesos
> 
> 
> Description
> -------
> 
> Introduced a 'UUID' type.
> 
> 
> Diffs
> -----
> 
>   include/mesos/mesos.proto 0ce25981f9fc7a45c76e8f0b0e75fb9836b9fab0 
>   include/mesos/resource_provider/resource_provider.proto 7ec693628451abd3c4da800a021a488c2d01eb50

>   include/mesos/type_utils.hpp 1bcc521546cf017ca5b33cb4edd509ce3aa64d5a 
>   include/mesos/v1/mesos.proto 10ce9493a86707b462268df4dca77c0a6a3b78d8 
>   include/mesos/v1/resource_provider/resource_provider.proto 31e8954b053c1541d2d0eba90ae9d0a7051b74ce

>   src/common/protobuf_utils.cpp c5504a00a7a84b824743f00c6b97ea299ac66eb4 
>   src/common/type_utils.cpp 65586a57b6d384350673903fb399b89a83fb9c37 
>   src/master/master.hpp 232cc3758f240db626c4fdaf852163fa48af4dd7 
>   src/master/master.cpp b10d0341276090bfa70aaa4fd6317a560e3334ea 
>   src/messages/messages.cpp 56876f2d5a92237ccb85ec6d8ab8eb872061a7b5 
>   src/messages/messages.proto e680cd5e4d5a93c3c77309f327844f55fbb239a1 
>   src/resource_provider/manager.cpp fd138b9914d925b5be7a11255dd632921c107dba 
>   src/resource_provider/message.hpp eab90cffd6aab9e38207dcf109cc737171ed3953 
>   src/slave/slave.cpp d2be4f4001cd30a927bb9d8675997185609ade1e 
>   src/status_update_manager/offer_operation.cpp f66690eadc0d7b16cc7de1b518904db2cab7ef82

>   src/status_update_manager/status_update_manager_process.hpp 1ac64410594134ce3e709d396d0a74a3d0aa2007

>   src/tests/mesos.hpp 320e9755c73bcf19ba8ac87f2081f17fdaa438ea 
>   src/tests/offer_operation_status_update_manager_tests.cpp a5327d3d070a390f2ceb918dc53a024fbfe8777e

>   src/tests/resource_provider_manager_tests.cpp e37a53ac6a03e2ea58dd6580fc8a399a1398d950

>   src/tests/resource_provider_validation_tests.cpp bf789a05771b7c25f2fc2a8a5b35d38519e4793b

>   src/tests/slave_tests.cpp 5228e03af1585817108094c587da6ae30d67df67 
> 
> 
> Diff: https://reviews.apache.org/r/64168/diff/6/
> 
> 
> Testing
> -------
> 
> make check
> 
> 
> Thanks,
> 
> Jan Schlicht
> 
>


Mime
  • Unnamed multipart/alternative (inline, None, 0 bytes)
View raw message