mesos-reviews mailing list archives

Site index · List index
Message view « Date » · « Thread »
Top « Date » · « Thread »
From Mesos Reviewbot Windows <revi...@mesos.apache.org>
Subject Re: Review Request 64505: Made the agent check for offer operation update retries.
Date Mon, 11 Dec 2017 22:27:54 GMT

-----------------------------------------------------------
This is an automatically generated e-mail. To reply, visit:
https://reviews.apache.org/r/64505/#review193463
-----------------------------------------------------------



FAIL: Some Mesos tests failed.

Reviews applied: `['64504', '64505']`

Failed command: `D:\DCOS\mesos\src\mesos-tests.exe --verbose`

All the build artifacts available at: http://dcos-win.westus.cloudapp.azure.com/mesos-build/review/64505

Relevant logs:

- [mesos-tests-stdout.log](http://dcos-win.westus.cloudapp.azure.com/mesos-build/review/64505/logs/mesos-tests-stdout.log):

```

[----------] 1 test from IsolationFlag/CpuIsolatorTest
[ RUN      ] IsolationFlag/CpuIsolatorTest.ROOT_UserCpuUsage/0
[       OK ] IsolationFlag/CpuIsolatorTest.ROOT_UserCpuUsage/0 (2316 ms)
[----------] 1 test from IsolationFlag/CpuIsolatorTest (2338 ms total)

[----------] 1 test from IsolationFlag/MemoryIsolatorTest
[ RUN      ] IsolationFlag/MemoryIsolatorTest.ROOT_MemUsage/0
[       OK ] IsolationFlag/MemoryIsolatorTest.ROOT_MemUsage/0 (2248 ms)
[----------] 1 test from IsolationFlag/MemoryIsolatorTest (2270 ms total)

[----------] Global test environment tear-down
[==========] 825 tests from 84 test cases ran. (302671 ms total)
[  PASSED  ] 815 tests.
[  FAILED  ] 10 tests, listed below:
[  FAILED  ] OfferOperationStatusUpdateManagerTest.UpdateAndAckNonTerminalUpdate
[  FAILED  ] OfferOperationStatusUpdateManagerTest.RecoverCheckpointedStream
[  FAILED  ] OfferOperationStatusUpdateManagerTest.RecoverEmptyFile
[  FAILED  ] OfferOperationStatusUpdateManagerTest.RecoverTerminatedStream
[  FAILED  ] OfferOperationStatusUpdateManagerTest.IgnoreDuplicateUpdate
[  FAILED  ] OfferOperationStatusUpdateManagerTest.IgnoreDuplicateUpdateAfterRecover
[  FAILED  ] OfferOperationStatusUpdateManagerTest.RejectDuplicateAck
[  FAILED  ] OfferOperationStatusUpdateManagerTest.RejectDuplicateAckAfterRecover
[  FAILED  ] OfferOperationStatusUpdateManagerTest.NonStrictRecoveryCorruptedFile
[  FAILED  ] SlaveTest.ResourceProviderPublishAll

10 FAILED TESTS
  YOU HAVE 204 DISABLED TESTS

```

- [mesos-tests-stderr.log](http://dcos-win.westus.cloudapp.azure.com/mesos-build/review/64505/logs/mesos-tests-stderr.log):

```
I1211 22:27:37.053275  6268 exec.cpp:237] Executor registered on agent 7349bd91-4165-4e53-8e9d-592a739b4cb8-S0
I1211 22:27:37.056277  6424 executor.cpp:171] Received SUBSCRIBED event
I1211 22:27:37.060281  6424 executor.cpp:175] Subscribed executor on build-srv-04.zq4gs31qjdiunm1ryi1452nvnh.dx.internal.cloudapp.net
I1211 22:27:37.060281  6424 executor.cpp:171] Received LAUNCH event
I1211 22:27:37.064281  6424 executor.cpp:637] Starting task f8f4f7fb-d1d9-4560-8eca-3048ab94455c
I1211 22:27:37.137276  6424 executor.cpp:477] Running 'D:\DCOS\mesos\src\mesos-containerizer.exe
launch <POSSIBLY-SENSITIVE-DATA>'
I1211 22:27:37.651247  6424 executor.cpp:650] Forked command at 692
I1211 22:27:37.678280  3592 exec.cpp:435] Executor asked to shutdown
I1211 22:27:37.679245  1392 executor.cpp:171] Received SHUTDOWN event
I1211 22:27:37.679245  1392 executor.cpp:747] Shutting down
I1211 22:27:37.679245  1392 executor.cpp:854] Sending SIGTERM to process tree at pid 69a739b4cb8-0000
I1211 22:27:37.677247  5132 master.cpp:10103] Updating the state of task f8f4f7fb-d1d9-4560-8eca-3048ab94455c
of framework 7349bd91-4165-4e53-8e9d-592a739b4cb8-0000 (latest state: TASK_KILLED, status
update state: TASK_KILLED)
I1211 22:27:37.677247  7484 slave.cpp:3400] Shutting down framework 7349bd91-4165-4e53-8e9d-592a739b4cb8-0000
I1211 22:27:37.677247  7484 slave.cpp:6091] Shutting down executor 'f8f4f7fb-d1d9-4560-8eca-3048ab94455c'
of framework 7349bd91-4165-4e53-8e9d-592a739b4cb8-0000 at executor(1)@10.3.1.5:63434
I1211 22:27:37.678280  7544 slave.cpp:909] Agent terminating
W1211 22:27:37.678280  7544 slave.cpp:3396] Ignoring shutdown framework 7349bd91-4165-4e53-8e9d-592a739b4cb8-0000
because it is terminating
I1211 22:27:37.679245  5132 master.cpp:10209] Removing task f8f4f7fb-d1d9-4560-8eca-3048ab94455c
with resources cpus(allocated: *):4; mem(allocated: *):2048; disk(allocated: *):1024; ports(allocated:
*):[31000-32000] of framework 7349bd91-4165-4e53-8e9d-592a739b4cb8-0000 on agent 7349bd91-4165-4e53-8e9d-592a739b4cb8-S0
at slave(326)@10.3.1.5:63413 (build-srv-04.zq4gs31qjdiunm1ryi1452nvnh.dx.internal.cloudapp.net)
I1211 22:27:37.681247  2424 containerizer.cpp:2328] Destroying container a5cfcaf1-87e2-4bbe-87bf-fbdc2f70ee49
in RUNNING state
I1211 22:27:37.681247  2424 containerizer.cpp:2930] Transitioning the state of container a5cfcaf1-87e2-4bbe-87bf-fbdc2f70ee49
from RUNNING to DESTROYING
I1211 22:27:37.682246  5132 master.cpp:1310] Agent 7349bd91-4165-4e53-8e9d-592a739b4cb8-S0
at slave(326)@10.3.1.5:63413 (build-srv-04.zq4gs31qjdiunm1ryi1452nvnh.dx.internal.cloudapp.net)
disconnected
I1211 22:27:37.682246  5132 master.cpp:3369] Disconnecting agent 7349bd91-4165-4e53-8e9d-592a739b4cb8-S0
at slave(326)@10.3.1.5:63413 (build-srv-04.zq4gs31qjdiunm1ryi1452nvnh.dx.internal.cloudapp.net)
I1211 22:27:37.682246  5132 master.cpp:3388] Deactivating agent 7349bd91-4165-4e53-8e9d-592a739b4cb8-S0
at slave(326)@10.3.1.5:63413 (build-srv-04.zq4gs31qjdiunm1ryi1452nvnh.dx.internal.cloudapp.net)
I1211 22:27:37.682246  2424 launcher.cpp:156] Asked to destroy container a5cfcaf1-87e2-4bbe-87bf-fbdc2f70ee49
I1211 22:27:37.683248  7272 hierarchical.cpp:344] Removed framework 7349bd91-4165-4e53-8e9d-592a739b4cb8-0000
I1211 22:27:37.683248  7272 hierarchical.cpp:762] Agent 7349bd91-4165-4e53-8e9d-592a739b4cb8-S0
deactivated
I1211 22:27:37.707832  7484 containerizer.cpp:2779] Container a5cfcaf1-87e2-4bbe-87bf-fbdc2f70ee49
has exited
I1211 22:27:37.736832  7544 master.cpp:1152] Master terminating
I1211 22:27:37.738818  7484 hierarchical.cpp:605] Removed agent 7349bd91-4165-4e53-8e9d-592a739b4cb8-S0
I1211 22:27:38.039849  8292 process.cpp:887] Failed to accept socket: future discarded
```

- Mesos Reviewbot Windows


On Dec. 11, 2017, 8:17 p.m., Greg Mann wrote:
> 
> -----------------------------------------------------------
> This is an automatically generated e-mail. To reply, visit:
> https://reviews.apache.org/r/64505/
> -----------------------------------------------------------
> 
> (Updated Dec. 11, 2017, 8:17 p.m.)
> 
> 
> Review request for mesos, Benjamin Bannier, Jie Yu, and Jan Schlicht.
> 
> 
> Repository: mesos
> 
> 
> Description
> -------
> 
> Local resource providers send all offer operation status updates
> using the reosurce provider API. This patch makes the agent's
> resource provider message handler skip operation updates when an
> update is a retry.
> 
> 
> Diffs
> -----
> 
>   src/slave/slave.cpp 373e393ca1e7c0c30c3474cc9e630e25ad92f235 
> 
> 
> Diff: https://reviews.apache.org/r/64505/diff/1/
> 
> 
> Testing
> -------
> 
> make check
> 
> 
> Thanks,
> 
> Greg Mann
> 
>


Mime
  • Unnamed multipart/alternative (inline, None, 0 bytes)
View raw message