mesos-reviews mailing list archives

Site index · List index
Message view « Date » · « Thread »
Top « Date » · « Thread »
From Mesos Reviewbot Windows <revi...@mesos.apache.org>
Subject Re: Review Request 64432: Windows: Enabled remaining `FlagsTests`.
Date Mon, 11 Dec 2017 20:40:24 GMT

-----------------------------------------------------------
This is an automatically generated e-mail. To reply, visit:
https://reviews.apache.org/r/64432/#review193439
-----------------------------------------------------------



FAIL: Some Mesos tests failed.

Reviews applied: `['64432']`

Failed command: `D:\DCOS\mesos\src\mesos-tests.exe --verbose`

All the build artifacts available at: http://dcos-win.westus.cloudapp.azure.com/mesos-build/review/64432

Relevant logs:

- [mesos-tests-stdout.log](http://dcos-win.westus.cloudapp.azure.com/mesos-build/review/64432/logs/mesos-tests-stdout.log):

```

[----------] 1 test from IsolationFlag/CpuIsolatorTest
[ RUN      ] IsolationFlag/CpuIsolatorTest.ROOT_UserCpuUsage/0
[       OK ] IsolationFlag/CpuIsolatorTest.ROOT_UserCpuUsage/0 (2384 ms)
[----------] 1 test from IsolationFlag/CpuIsolatorTest (2408 ms total)

[----------] 1 test from IsolationFlag/MemoryIsolatorTest
[ RUN      ] IsolationFlag/MemoryIsolatorTest.ROOT_MemUsage/0
[       OK ] IsolationFlag/MemoryIsolatorTest.ROOT_MemUsage/0 (2485 ms)
[----------] 1 test from IsolationFlag/MemoryIsolatorTest (2520 ms total)

[----------] Global test environment tear-down
[==========] 825 tests from 84 test cases ran. (317320 ms total)
[  PASSED  ] 815 tests.
[  FAILED  ] 10 tests, listed below:
[  FAILED  ] OfferOperationStatusUpdateManagerTest.UpdateAndAckNonTerminalUpdate
[  FAILED  ] OfferOperationStatusUpdateManagerTest.RecoverCheckpointedStream
[  FAILED  ] OfferOperationStatusUpdateManagerTest.RecoverEmptyFile
[  FAILED  ] OfferOperationStatusUpdateManagerTest.RecoverTerminatedStream
[  FAILED  ] OfferOperationStatusUpdateManagerTest.IgnoreDuplicateUpdate
[  FAILED  ] OfferOperationStatusUpdateManagerTest.IgnoreDuplicateUpdateAfterRecover
[  FAILED  ] OfferOperationStatusUpdateManagerTest.RejectDuplicateAck
[  FAILED  ] OfferOperationStatusUpdateManagerTest.RejectDuplicateAckAfterRecover
[  FAILED  ] OfferOperationStatusUpdateManagerTest.NonStrictRecoveryCorruptedFile
[  FAILED  ] SlaveTest.ResourceProviderPublishAll

10 FAILED TESTS
  YOU HAVE 201 DISABLED TESTS

```

- [mesos-tests-stderr.log](http://dcos-win.westus.cloudapp.azure.com/mesos-build/review/64432/logs/mesos-tests-stderr.log):

```
I1211 20:40:05.119837 10188 master.cpp:10103] Updating the state of task 11ff53fd-5a7a-497b-a357-ace8c118cbb1
of framework 39c39a27-c576-492d-a4bb-3bf7cb744f04-0000 (latest state: TASK_KILLED, status
update state: TASK_KILLED)
I1211 20:40:05.119837  5496 slave.cpp:3400] Shutting down framework 39c39a27-c576-492d-a4bb-3bf7cb744f04-0000
I1211 20:40:05.119837  5496 slave.cpp:6091] Shutting down executor '11ff53fd-5a7a-497b-a357-ace8c118cbb1'
of framework 39c39a27-c576-492d-a4bb-3bf7cI1211 20:40:04.412895  8656 exec.cpp:162] Version:
1.5.0
I1211 20:40:04.436869  5564 exec.cpp:237] Executor registered on agent 39c39a27-c576-492d-a4bb-3bf7cb744f04-S0
I1211 20:40:04.439895  5836 executor.cpp:171] Received SUBSCRIBED event
I1211 20:40:04.443892  5836 executor.cpp:175] Subscribed executor on build-srv-03.zq4gs31qjdiunm1ryi1452nvnh.dx.internal.cloudapp.net
I1211 20:40:04.443892  5836 executor.cpp:171] Received LAUNCH event
I1211 20:40:04.447908  5836 executor.cpp:637] Starting task 11ff53fd-5a7a-497b-a357-ace8c118cbb1
I1211 20:40:04.522887  5836 executor.cpp:477] Running 'D:\DCOS\mesos\src\mesos-containerizer.exe
launch <POSSIBLY-SENSITIVE-DATA>'
I1211 20:40:05.094864  5836 executor.cpp:650] Forked command at 1868
I1211 20:40:05.121870 10012 exec.cpp:435] Executor asked to shutdown
I1211 20:40:05.121870  5836 executor.cpp:171] Received SHUTDOWN event
I1211 20:40:05.121870  5836 executor.cpp:747] Shutting down
I1211 20:40:05.121870  5836 executor.cpp:854] Sending SIGTERM to process tree at pid 1b744f04-0000
at executor(1)@10.3.1.11:57746
I1211 20:40:05.120836  5496 slave.cpp:909] Agent terminating
W1211 20:40:05.121870  5496 slave.cpp:3396] Ignoring shutdown framework 39c39a27-c576-492d-a4bb-3bf7cb744f04-0000
because it is terminating
I1211 20:40:05.122866 10188 master.cpp:10209] Removing task 11ff53fd-5a7a-497b-a357-ace8c118cbb1
with resources cpus(allocated: *):4; mem(allocated: *):2048; disk(allocated: *):1024; ports(allocated:
*):[31000-32000] of framework 39c39a27-c576-492d-a4bb-3bf7cb744f04-0000 on agent 39c39a27-c576-492d-a4bb-3bf7cb744f04-S0
at slave(326)@10.3.1.11:57725 (build-srv-03.zq4gs31qjdiunm1ryi1452nvnh.dx.internal.cloudapp.net)
I1211 20:40:05.123836  9844 containerizer.cpp:2328] Destroying container 8b452202-ac2f-438b-92bd-e7d4e1b7bb1d
in RUNNING state
I1211 20:40:05.124838  9844 containerizer.cpp:2930] Transitioning the state of container 8b452202-ac2f-438b-92bd-e7d4e1b7bb1d
from RUNNING to DESTROYING
I1211 20:40:05.124838 10188 master.cpp:1310] Agent 39c39a27-c576-492d-a4bb-3bf7cb744f04-S0
at slave(326)@10.3.1.11:57725 (build-srv-03.zq4gs31qjdiunm1ryi1452nvnh.dx.internal.cloudapp.net)
disconnected
I1211 20:40:05.124838  5908 hierarchical.cpp:344] Removed framework 39c39a27-c576-492d-a4bb-3bf7cb744f04-0000
I1211 20:40:05.124838  9844 launcher.cpp:156] Asked to destroy container 8b452202-ac2f-438b-92bd-e7d4e1b7bb1d
I1211 20:40:05.125838 10188 master.cpp:3369] Disconnecting agent 39c39a27-c576-492d-a4bb-3bf7cb744f04-S0
at slave(326)@10.3.1.11:57725 (build-srv-03.zq4gs31qjdiunm1ryi1452nvnh.dx.internal.cloudapp.net)
I1211 20:40:05.125838 10188 master.cpp:3388] Deactivating agent 39c39a27-c576-492d-a4bb-3bf7cb744f04-S0
at slave(326)@10.3.1.11:57725 (build-srv-03.zq4gs31qjdiunm1ryi1452nvnh.dx.internal.cloudapp.net)
I1211 20:40:05.125838  7528 hierarchical.cpp:762] Agent 39c39a27-c576-492d-a4bb-3bf7cb744f04-S0
deactivated
I1211 20:40:05.196898  9844 containerizer.cpp:2779] Container 8b452202-ac2f-438b-92bd-e7d4e1b7bb1d
has exited
I1211 20:40:05.232918  4464 master.cpp:1152] Master terminating
I1211 20:40:05.235924  9844 hierarchical.cpp:605] Removed agent 39c39a27-c576-492d-a4bb-3bf7cb744f04-S0
I1211 20:40:05.573931  8388 process.cpp:887] Failed to accept socket: future discarded
```

- Mesos Reviewbot Windows


On Dec. 11, 2017, 6:13 p.m., Andrew Schwartzmeyer wrote:
> 
> -----------------------------------------------------------
> This is an automatically generated e-mail. To reply, visit:
> https://reviews.apache.org/r/64432/
> -----------------------------------------------------------
> 
> (Updated Dec. 11, 2017, 6:13 p.m.)
> 
> 
> Review request for mesos, Akash Gupta and Joseph Wu.
> 
> 
> Bugs: MESOS-3437
>     https://issues.apache.org/jira/browse/MESOS-3437
> 
> 
> Repository: mesos
> 
> 
> Description
> -------
> 
> This resolve MESOS-3437 trivially because MESOS-5880 and MESOS-5937 have
> since been resolved.
> 
> This replaces review 63239 because the final iteration was not right.
> 
> 
> Diffs
> -----
> 
>   3rdparty/stout/tests/flags_tests.cpp 88c8ee57c2bf328251513761498ef98d774be006 
> 
> 
> Diff: https://reviews.apache.org/r/64432/diff/2/
> 
> 
> Testing
> -------
> 
> [==========] Running 26 tests from 1 test case.
> [----------] Global test environment set-up.
> [----------] 26 tests from FlagsTest
> [ RUN      ] FlagsTest.Load
> [       OK ] FlagsTest.Load (0 ms)
> [ RUN      ] FlagsTest.Add
> [       OK ] FlagsTest.Add (0 ms)
> [ RUN      ] FlagsTest.Alias
> [       OK ] FlagsTest.Alias (0 ms)
> [ RUN      ] FlagsTest.Flags
> [       OK ] FlagsTest.Flags (0 ms)
> [ RUN      ] FlagsTest.LoadFromEnvironment
> [       OK ] FlagsTest.LoadFromEnvironment (1 ms)
> [ RUN      ] FlagsTest.LoadFromCommandLine
> [       OK ] FlagsTest.LoadFromCommandLine (2 ms)
> [ RUN      ] FlagsTest.LoadFromCommandLineWithNonFlags
> [       OK ] FlagsTest.LoadFromCommandLineWithNonFlags (2 ms)
> [ RUN      ] FlagsTest.LoadFromCommandLineWithDashDash
> [       OK ] FlagsTest.LoadFromCommandLineWithDashDash (1 ms)
> [ RUN      ] FlagsTest.LoadFromCommandLineAndUpdateArgcArgv
> [       OK ] FlagsTest.LoadFromCommandLineAndUpdateArgcArgv (1 ms)
> [ RUN      ] FlagsTest.Stringification
> [       OK ] FlagsTest.Stringification (1 ms)
> [ RUN      ] FlagsTest.EffectiveName
> [       OK ] FlagsTest.EffectiveName (0 ms)
> [ RUN      ] FlagsTest.DeprecationWarning
> [       OK ] FlagsTest.DeprecationWarning (0 ms)
> [ RUN      ] FlagsTest.DuplicatesFromEnvironment
> [       OK ] FlagsTest.DuplicatesFromEnvironment (6 ms)
> [ RUN      ] FlagsTest.DuplicatesFromCommandLine
> [       OK ] FlagsTest.DuplicatesFromCommandLine (2 ms)
> [ RUN      ] FlagsTest.AliasDuplicateFromCommandLine
> [       OK ] FlagsTest.AliasDuplicateFromCommandLine (1 ms)
> [ RUN      ] FlagsTest.Errors
> [       OK ] FlagsTest.Errors (10 ms)
> [ RUN      ] FlagsTest.MissingRequiredFlag
> [       OK ] FlagsTest.MissingRequiredFlag (1 ms)
> [ RUN      ] FlagsTest.Validate
> [       OK ] FlagsTest.Validate (1 ms)
> [ RUN      ] FlagsTest.Usage
> [       OK ] FlagsTest.Usage (0 ms)
> [ RUN      ] FlagsTest.UsageMessage
> [       OK ] FlagsTest.UsageMessage (1 ms)
> [ RUN      ] FlagsTest.EmptyUsage
> [       OK ] FlagsTest.EmptyUsage (1 ms)
> [ RUN      ] FlagsTest.ProgramName
> [       OK ] FlagsTest.ProgramName (0 ms)
> [ RUN      ] FlagsTest.OptionalMessage
> [       OK ] FlagsTest.OptionalMessage (0 ms)
> [ RUN      ] FlagsTest.BuildEnvironment
> [       OK ] FlagsTest.BuildEnvironment (1 ms)
> [ RUN      ] FlagsTest.Duration
> [       OK ] FlagsTest.Duration (0 ms)
> [ RUN      ] FlagsTest.JSON
> [       OK ] FlagsTest.JSON (1 ms)
> 
> 
> Thanks,
> 
> Andrew Schwartzmeyer
> 
>


Mime
  • Unnamed multipart/alternative (inline, None, 0 bytes)
View raw message