mesos-reviews mailing list archives

Site index · List index
Message view « Date » · « Thread »
Top « Date » · « Thread »
From Mesos Reviewbot Windows <revi...@mesos.apache.org>
Subject Re: Review Request 64475: Initialized offer operation status update manager in SLRP.
Date Mon, 11 Dec 2017 16:25:37 GMT

-----------------------------------------------------------
This is an automatically generated e-mail. To reply, visit:
https://reviews.apache.org/r/64475/#review193400
-----------------------------------------------------------



FAIL: Some Mesos tests failed.

Reviews applied: `['64439', '64469', '64475']`

Failed command: `C:\DCOS\mesos\src\mesos-tests.exe --verbose`

All the build artifacts available at: http://dcos-win.westus.cloudapp.azure.com/mesos-build/review/64475

Relevant logs:

- [mesos-tests-stdout.log](http://dcos-win.westus.cloudapp.azure.com/mesos-build/review/64475/logs/mesos-tests-stdout.log):

```

[----------] 1 test from IsolationFlag/CpuIsolatorTest
[ RUN      ] IsolationFlag/CpuIsolatorTest.ROOT_UserCpuUsage/0
[       OK ] IsolationFlag/CpuIsolatorTest.ROOT_UserCpuUsage/0 (2475 ms)
[----------] 1 test from IsolationFlag/CpuIsolatorTest (2513 ms total)

[----------] 1 test from IsolationFlag/MemoryIsolatorTest
[ RUN      ] IsolationFlag/MemoryIsolatorTest.ROOT_MemUsage/0
[       OK ] IsolationFlag/MemoryIsolatorTest.ROOT_MemUsage/0 (2565 ms)
[----------] 1 test from IsolationFlag/MemoryIsolatorTest (2600 ms total)

[----------] Global test environment tear-down
[==========] 825 tests from 84 test cases ran. (374018 ms total)
[  PASSED  ] 815 tests.
[  FAILED  ] 10 tests, listed below:
[  FAILED  ] OfferOperationStatusUpdateManagerTest.UpdateAndAckNonTerminalUpdate
[  FAILED  ] OfferOperationStatusUpdateManagerTest.RecoverCheckpointedStream
[  FAILED  ] OfferOperationStatusUpdateManagerTest.RecoverEmptyFile
[  FAILED  ] OfferOperationStatusUpdateManagerTest.RecoverTerminatedStream
[  FAILED  ] OfferOperationStatusUpdateManagerTest.IgnoreDuplicateUpdate
[  FAILED  ] OfferOperationStatusUpdateManagerTest.IgnoreDuplicateUpdateAfterRecover
[  FAILED  ] OfferOperationStatusUpdateManagerTest.RejectDuplicateAck
[  FAILED  ] OfferOperationStatusUpdateManagerTest.RejectDuplicateAckAfterRecover
[  FAILED  ] OfferOperationStatusUpdateManagerTest.NonStrictRecoveryCorruptedFile
[  FAILED  ] SlaveTest.ResourceProviderPublishAll

10 FAILED TESTS
  YOU HAVE 201 DISABLED TESTS

```

- [mesos-tests-stderr.log](http://dcos-win.westus.cloudapp.azure.com/mesos-build/review/64475/logs/mesos-tests-stderr.log):

```
I1211 16:25:11.456578  6300 master.cpp:3332] Deactivating framework c63a23ba-89cc-415e-bffd-9253d345b107-0000
(default) at scheduler-d0274afd-15fc-4d0d-9910-b2bb18a6bff4@10.3.1.11:64867
I1211 16:25:11.456578  6108 slave.cpp:3400] Shutting down framework c63a23ba-89cc-415e-bffd-9253d345b107-0000
I1211 16:25:11.457577  6108 slave.cpp:6091] Shutting down executor '4de9a7db-ed68-4a52-8603-cc116780390b'
of framework c63a23ba-89cc-415e-bffd-9253d345b107-0000 at executor(1)@10.3.1.11:64888
I1211 16:25:11.457577  8756 hierarchical.cpp:405] Deactivated framework c63a23ba-89cc-415e-bffd-9253d345b107-0000
I1211 16:25:11.457577  6300 master.cpp:10105] Updating the state of task 4I1211 16:25:10.744648
 5568 exec.cpp:162] Version: 1.5.0
I1211 16:25:10.768647  3416 exec.cpp:237] Executor registered on agent c63a23ba-89cc-415e-bffd-9253d345b107-S0
I1211 16:25:10.771648  3712 executor.cpp:171] Received SUBSCRIBED event
I1211 16:25:10.775676  3712 executor.cpp:175] Subscribed executor on build-srv-03.zq4gs31qjdiunm1ryi1452nvnh.dx.internal.cloudapp.net
I1211 16:25:10.776670  3712 executor.cpp:171] Received LAUNCH event
I1211 16:25:10.779644  3712 executor.cpp:637] Starting task 4de9a7db-ed68-4a52-8603-cc116780390b
I1211 16:25:10.853644  3712 executor.cpp:477] Running 'C:\DCOS\mesos\src\mesos-containerizer.exe
launch <POSSIBLY-SENSITIVE-DATA>'
I1211 16:25:11.421582  3712 executor.cpp:650] Forked command at 3924
I1211 16:25:11.458578  7048 exec.cpp:435] Executor asked to shutdown
I1211 16:25:11.459578  3712 executor.cpp:171] Received SHUTDOWN event
I1211 16:25:11.459578  3712 executor.cpp:747] Shutting down
I1211 16:25:11.459578  3712 executor.cpp:854] Sending SIGTERM to process tree at pid 3de9a7db-ed68-4a52-8603-cc116780390b
of framework c63a23ba-89cc-415e-bffd-9253d345b107-0000 (latest state: TASK_KILLED, status
update state: TASK_KILLED)
I1211 16:25:11.459578  9752 containerizer.cpp:2328] Destroying container fb1537d2-d1c7-4a75-b419-493d744400f3
in RUNNING state
I1211 16:25:11.462577  9752 containerizer.cpp:2930] Transitioning the state of container fb1537d2-d1c7-4a75-b419-493d744400f3
from RUNNING to DESTROYING
I1211 16:25:11.463577  9752 launcher.cpp:156] Asked to destroy container fb1537d2-d1c7-4a75-b419-493d744400f3
I1211 16:25:11.464581  6300 master.cpp:10211] Removing task 4de9a7db-ed68-4a52-8603-cc116780390b
with resources cpus(allocated: *):4; mem(allocated: *):2048; disk(allocated: *):1024; ports(allocated:
*):[31000-32000] of framework c63a23ba-89cc-415e-bffd-9253d345b107-0000 on agent c63a23ba-89cc-415e-bffd-9253d345b107-S0
at slave(326)@10.3.1.11:64867 (build-srv-03.zq4gs31qjdiunm1ryi1452nvnh.dx.internal.cloudapp.net)
I1211 16:25:11.466578  6300 master.cpp:1310] Agent c63a23ba-89cc-415e-bffd-9253d345b107-S0
at slave(326)@10.3.1.11:64867 (build-srv-03.zq4gs31qjdiunm1ryi1452nvnh.dx.internal.cloudapp.net)
disconnected
I1211 16:25:11.466578  2592 hierarchical.cpp:344] Removed framework c63a23ba-89cc-415e-bffd-9253d345b107-0000
I1211 16:25:11.472733  6300 master.cpp:3369] Disconnecting agent c63a23ba-89cc-415e-bffd-9253d345b107-S0
at slave(326)@10.3.1.11:64867 (build-srv-03.zq4gs31qjdiunm1ryi1452nvnh.dx.internal.cloudapp.net)
I1211 16:25:11.472733  6300 master.cpp:3388] Deactivating agent c63a23ba-89cc-415e-bffd-9253d345b107-S0
at slave(326)@10.3.1.11:64867 (build-srv-03.zq4gs31qjdiunm1ryi1452nvnh.dx.internal.cloudapp.net)
I1211 16:25:11.472733  8756 hierarchical.cpp:762] Agent c63a23ba-89cc-415e-bffd-9253d345b107-S0
deactivated
I1211 16:25:11.512655  8252 containerizer.cpp:2779] Container fb1537d2-d1c7-4a75-b419-493d744400f3
has exited
I1211 16:25:11.543674  6108 master.cpp:1152] Master terminating
I1211 16:25:11.545650  8252 hierarchical.cpp:605] Removed agent c63a23ba-89cc-415e-bffd-9253d345b107-S0
I1211 16:25:11.876648  4132 process.cpp:887] Failed to accept socket: future discarded
```

- Mesos Reviewbot Windows


On Dec. 9, 2017, 12:06 a.m., Chun-Hung Hsiao wrote:
> 
> -----------------------------------------------------------
> This is an automatically generated e-mail. To reply, visit:
> https://reviews.apache.org/r/64475/
> -----------------------------------------------------------
> 
> (Updated Dec. 9, 2017, 12:06 a.m.)
> 
> 
> Review request for mesos, Greg Mann and Jie Yu.
> 
> 
> Repository: mesos
> 
> 
> Description
> -------
> 
> This patch adds an agent filesystem layout for checkpointing offer
> operation status updates for resource providers, and initialized
> a status update manager in storage local resource provider.
> 
> 
> Diffs
> -----
> 
>   src/resource_provider/storage/provider.cpp 2193866e83850a04a3dc8231ab07e6104485f2b6

>   src/slave/paths.hpp d645d871c36bbe8e766a98650f6aa23b6eab65d8 
>   src/slave/paths.cpp b8004e76964abc210820368a89dbfa6928ef7bfd 
> 
> 
> Diff: https://reviews.apache.org/r/64475/diff/1/
> 
> 
> Testing
> -------
> 
> make
> 
> 
> Thanks,
> 
> Chun-Hung Hsiao
> 
>


Mime
  • Unnamed multipart/alternative (inline, None, 0 bytes)
View raw message