mesos-reviews mailing list archives

Site index · List index
Message view « Date » · « Thread »
Top « Date » · « Thread »
From Mesos Reviewbot Windows <revi...@mesos.apache.org>
Subject Re: Review Request 64432: Windows: Enabled remaining `FlagsTests`.
Date Fri, 08 Dec 2017 14:16:49 GMT

-----------------------------------------------------------
This is an automatically generated e-mail. To reply, visit:
https://reviews.apache.org/r/64432/#review193251
-----------------------------------------------------------



FAIL: Some Mesos libprocess-tests failed.

Reviews applied: `['64432']`

Failed command: `C:\DCOS\mesos\3rdparty\libprocess\src\tests\Debug\libprocess-tests.exe`

All the build artifacts available at: http://dcos-win.westus.cloudapp.azure.com/mesos-build/review/64432

Relevant logs:

- [libprocess-tests-stdout.log](http://dcos-win.westus.cloudapp.azure.com/mesos-build/review/64432/logs/libprocess-tests-stdout.log):

```
C:\DCOS\mesos\mesos\3rdparty\libprocess\src\tests\ssl_tests.cpp(440): error: Failed to wait
15secs for socket
[  FAILED  ] SSLVerifyIPAdd/SSLTest.RequireCertificate/0, where GetParam() = "false" (16522
ms)
[ RUN      ] SSLVerifyIPAdd/SSLTest.RequireCertificate/1
C:\DCOS\mesos\mesos\3rdparty\libprocess\src\tests\ssl_tests.cpp(440): error: Failed to wait
15secs for socket
[  FAILED  ] SSLVerifyIPAdd/SSLTest.RequireCertificate/1, where GetParam() = "true" (16639
ms)
[----------] 4 tests from SSLVerifyIPAdd/SSLTest (34181 ms total)

[----------] Global test environment tear-down
[==========] 223 tests from 35 test cases ran. (260883 ms total)
[  PASSED  ] 209 tests.
[  FAILED  ] 14 tests, listed below:
[  FAILED  ] SSLTest.SSLSocket
[  FAILED  ] SSLTest.NonSSLSocket
[  FAILED  ] SSLTest.NoVerifyBadCA
[  FAILED  ] SSLTest.RequireBadCA
[  FAILED  ] SSLTest.VerifyBadCA
[  FAILED  ] SSLTest.VerifyCertificate
[  FAILED  ] SSLTest.ProtocolMismatch
[  FAILED  ] SSLTest.ECDHESupport
[  FAILED  ] SSLTest.ValidDowngrade
[  FAILED  ] SSLTest.NoValidDowngrade
[  FAILED  ] SSLTest.ValidDowngradeEachProtocol
[  FAILED  ] SSLTest.NoValidDowngradeEachProtocol
[  FAILED  ] SSLVerifyIPAdd/SSLTest.RequireCertificate/0, where GetParam() = "false"
[  FAILED  ] SSLVerifyIPAdd/SSLTest.RequireCertificate/1, where GetParam() = "true"

14 FAILED TESTS
  YOU HAVE 19 DISABLED TESTS

```

- [libprocess-tests-stderr.log](http://dcos-win.westus.cloudapp.azure.com/mesos-build/review/64432/logs/libprocess-tests-stderr.log):

```
I1208 14:15:43.581799  7084 process.cpp:887] Failed to accept socket: future discarded
I1208 14:15:43.766700  8680 process.cpp:887] Failed to accept socket: future discarded
I1208 14:15:44.238422  7320 openssl.cpp:514] Will not verify peer certificate!
NOTE: Set LIBPROCESS_SSL_VERIFY_CERT=1 to enable peer certificate verification
I1208 14:15:44.238422  7320 openssl.cpp:534] LIBPROCESS_SSL_REQUIRE_CERT implies peer certificate
verification.
LIBPROCESS_SSL_VERIFY_CERT set to true
I1208 14:15:44.238422  7320 openssl.cpp:563] Using CA file: C:\Users\mesos\AppData\Local\Temp\nor2Vd\cert.pem
I1208 14:15:44.238422  7320 openssl.cpp:566] Using CA dir: C:\Users\mesos\AppData\Local\Temp\nor2Vd
I1208 14:15:44.748996  7320 openssl.cpp:514] Will not verify peer certificate!
NOTE: Set LIBPROCESS_SSL_VERIFY_CERT=1 to enable peer certificate verification
I1208 14:15:44.748996  7320 openssl.cpp:526] Will use IP address verification in subject alternative
name certificate extension.
I1208 14:15:44.748996  7320 openssl.cpp:534] LIBPROCESS_SSL_REQUIRE_CERT implies peer certificate
verification.
LIBPROCESS_SSL_VERIFY_CERT set to true
I1208 14:15:44.775720  7320 openssl.cpp:563] Using CA file: C:\Users\mesos\AppData\Local\Temp\sncsII\cert.pem
I1208 14:15:44.775720  7320 openssl.cpp:566] Using CA dir: C:\Users\mesos\AppData\Local\Temp\sncsII
I1208 14:15:45.315922  7320 openssl.cpp:509] CA directory path unspecified! NOTE: Set CA directory
path with LIBPROCESS_SSL_CA_DIR=<dirpath>
I1208 14:15:45.315922  7320 openssl.cpp:514] Will not verify peer certificate!
NOTE: Set LIBPROCESS_SSL_VERIFY_CERT=1 to enable peer certificate verification
I1208 14:15:45.315922  7320 openssl.cpp:534] LIBPROCESS_SSL_REQUIRE_CERT implies peer certificate
verification.
LIBPROCESS_SSL_VERIFY_CERT set to true
I1208 14:15:45.316922  7320 openssl.cpp:563] Using CA file: C:\Users\mesos\AppData\Local\Temp\pVOuf6\cert.pem
I1208 14:16:01.966287  7320 openssl.cpp:509] CA directory path unspecified! NOTE: Set CA directory
path with LIBPROCESS_SSL_CA_DIR=<dirpath>
I1208 14:16:01.966287  7320 openssl.cpp:514] Will not verify peer certificate!
NOTE: Set LIBPROCESS_SSL_VERIFY_CERT=1 to enable peer certificate verification
I1208 14:16:01.966287  7320 openssl.cpp:526] Will use IP address verification in subject alternative
name certificate extension.
I1208 14:16:01.966287  7320 openssl.cpp:534] LIBPROCESS_SSL_REQUIRE_CERT implies peer certificate
verification.
LIBPROCESS_SSL_VERIFY_CERT set to true
I1208 14:16:01.967288  7320 openssl.cpp:563] Using CA file: C:\Users\mesos\AppData\Local\Temp\P8i12R\cert.pem
I1208 14:16:18.091749  5912 process.cpp:887] Failed to accept socket: future discarded
```

- Mesos Reviewbot Windows


On Dec. 8, 2017, 12:23 a.m., Andrew Schwartzmeyer wrote:
> 
> -----------------------------------------------------------
> This is an automatically generated e-mail. To reply, visit:
> https://reviews.apache.org/r/64432/
> -----------------------------------------------------------
> 
> (Updated Dec. 8, 2017, 12:23 a.m.)
> 
> 
> Review request for mesos, Akash Gupta and Joseph Wu.
> 
> 
> Bugs: MESOS-3437
>     https://issues.apache.org/jira/browse/MESOS-3437
> 
> 
> Repository: mesos
> 
> 
> Description
> -------
> 
> This resolve MESOS-3437 trivially because MESOS-5880 and MESOS-5937 have
> since been resolved.
> 
> This replaces review 63239 because the final iteration was not right.
> 
> 
> Diffs
> -----
> 
>   3rdparty/stout/tests/flags_tests.cpp 88c8ee57c2bf328251513761498ef98d774be006 
> 
> 
> Diff: https://reviews.apache.org/r/64432/diff/1/
> 
> 
> Testing
> -------
> 
> [==========] Running 26 tests from 1 test case.
> [----------] Global test environment set-up.
> [----------] 26 tests from FlagsTest
> [ RUN      ] FlagsTest.Load
> [       OK ] FlagsTest.Load (0 ms)
> [ RUN      ] FlagsTest.Add
> [       OK ] FlagsTest.Add (0 ms)
> [ RUN      ] FlagsTest.Alias
> [       OK ] FlagsTest.Alias (0 ms)
> [ RUN      ] FlagsTest.Flags
> [       OK ] FlagsTest.Flags (0 ms)
> [ RUN      ] FlagsTest.LoadFromEnvironment
> [       OK ] FlagsTest.LoadFromEnvironment (1 ms)
> [ RUN      ] FlagsTest.LoadFromCommandLine
> [       OK ] FlagsTest.LoadFromCommandLine (2 ms)
> [ RUN      ] FlagsTest.LoadFromCommandLineWithNonFlags
> [       OK ] FlagsTest.LoadFromCommandLineWithNonFlags (2 ms)
> [ RUN      ] FlagsTest.LoadFromCommandLineWithDashDash
> [       OK ] FlagsTest.LoadFromCommandLineWithDashDash (1 ms)
> [ RUN      ] FlagsTest.LoadFromCommandLineAndUpdateArgcArgv
> [       OK ] FlagsTest.LoadFromCommandLineAndUpdateArgcArgv (1 ms)
> [ RUN      ] FlagsTest.Stringification
> [       OK ] FlagsTest.Stringification (1 ms)
> [ RUN      ] FlagsTest.EffectiveName
> [       OK ] FlagsTest.EffectiveName (0 ms)
> [ RUN      ] FlagsTest.DeprecationWarning
> [       OK ] FlagsTest.DeprecationWarning (0 ms)
> [ RUN      ] FlagsTest.DuplicatesFromEnvironment
> [       OK ] FlagsTest.DuplicatesFromEnvironment (6 ms)
> [ RUN      ] FlagsTest.DuplicatesFromCommandLine
> [       OK ] FlagsTest.DuplicatesFromCommandLine (2 ms)
> [ RUN      ] FlagsTest.AliasDuplicateFromCommandLine
> [       OK ] FlagsTest.AliasDuplicateFromCommandLine (1 ms)
> [ RUN      ] FlagsTest.Errors
> [       OK ] FlagsTest.Errors (10 ms)
> [ RUN      ] FlagsTest.MissingRequiredFlag
> [       OK ] FlagsTest.MissingRequiredFlag (1 ms)
> [ RUN      ] FlagsTest.Validate
> [       OK ] FlagsTest.Validate (1 ms)
> [ RUN      ] FlagsTest.Usage
> [       OK ] FlagsTest.Usage (0 ms)
> [ RUN      ] FlagsTest.UsageMessage
> [       OK ] FlagsTest.UsageMessage (1 ms)
> [ RUN      ] FlagsTest.EmptyUsage
> [       OK ] FlagsTest.EmptyUsage (1 ms)
> [ RUN      ] FlagsTest.ProgramName
> [       OK ] FlagsTest.ProgramName (0 ms)
> [ RUN      ] FlagsTest.OptionalMessage
> [       OK ] FlagsTest.OptionalMessage (0 ms)
> [ RUN      ] FlagsTest.BuildEnvironment
> [       OK ] FlagsTest.BuildEnvironment (1 ms)
> [ RUN      ] FlagsTest.Duration
> [       OK ] FlagsTest.Duration (0 ms)
> [ RUN      ] FlagsTest.JSON
> [       OK ] FlagsTest.JSON (1 ms)
> 
> 
> Thanks,
> 
> Andrew Schwartzmeyer
> 
>


Mime
  • Unnamed multipart/alternative (inline, None, 0 bytes)
View raw message