mesos-reviews mailing list archives

Site index · List index
Message view « Date » · « Thread »
Top « Date » · « Thread »
From Mesos Reviewbot Windows <revi...@mesos.apache.org>
Subject Re: Review Request 64430: Only passed agent's resource version in top-level 'UpdateSlaveMessage'.
Date Fri, 08 Dec 2017 12:35:35 GMT

-----------------------------------------------------------
This is an automatically generated e-mail. To reply, visit:
https://reviews.apache.org/r/64430/#review193245
-----------------------------------------------------------



FAIL: Some Mesos libprocess-tests failed.

Reviews applied: `['64422', '64423', '64424', '64430']`

Failed command: `C:\DCOS\mesos\3rdparty\libprocess\src\tests\Debug\libprocess-tests.exe`

All the build artifacts available at: http://dcos-win.westus.cloudapp.azure.com/mesos-build/review/64430

Relevant logs:

- [libprocess-tests-stdout.log](http://dcos-win.westus.cloudapp.azure.com/mesos-build/review/64430/logs/libprocess-tests-stdout.log):

```
C:\DCOS\mesos\mesos\3rdparty\libprocess\src\tests\ssl_tests.cpp(440): error: Failed to wait
15secs for socket
[  FAILED  ] SSLVerifyIPAdd/SSLTest.RequireCertificate/0, where GetParam() = "false" (16525
ms)
[ RUN      ] SSLVerifyIPAdd/SSLTest.RequireCertificate/1
C:\DCOS\mesos\mesos\3rdparty\libprocess\src\tests\ssl_tests.cpp(440): error: Failed to wait
15secs for socket
[  FAILED  ] SSLVerifyIPAdd/SSLTest.RequireCertificate/1, where GetParam() = "true" (16735
ms)
[----------] 4 tests from SSLVerifyIPAdd/SSLTest (33932 ms total)

[----------] Global test environment tear-down
[==========] 223 tests from 35 test cases ran. (262051 ms total)
[  PASSED  ] 209 tests.
[  FAILED  ] 14 tests, listed below:
[  FAILED  ] SSLTest.SSLSocket
[  FAILED  ] SSLTest.NonSSLSocket
[  FAILED  ] SSLTest.NoVerifyBadCA
[  FAILED  ] SSLTest.RequireBadCA
[  FAILED  ] SSLTest.VerifyBadCA
[  FAILED  ] SSLTest.VerifyCertificate
[  FAILED  ] SSLTest.ProtocolMismatch
[  FAILED  ] SSLTest.ECDHESupport
[  FAILED  ] SSLTest.ValidDowngrade
[  FAILED  ] SSLTest.NoValidDowngrade
[  FAILED  ] SSLTest.ValidDowngradeEachProtocol
[  FAILED  ] SSLTest.NoValidDowngradeEachProtocol
[  FAILED  ] SSLVerifyIPAdd/SSLTest.RequireCertificate/0, where GetParam() = "false"
[  FAILED  ] SSLVerifyIPAdd/SSLTest.RequireCertificate/1, where GetParam() = "true"

14 FAILED TESTS
  YOU HAVE 19 DISABLED TESTS

```

- [libprocess-tests-stderr.log](http://dcos-win.westus.cloudapp.azure.com/mesos-build/review/64430/logs/libprocess-tests-stderr.log):

```
I1208 12:34:23.694483  5020 process.cpp:887] Failed to accept socket: future discarded
I1208 12:34:23.893543  6648 process.cpp:887] Failed to accept socket: future discarded
I1208 12:34:24.186502  4348 openssl.cpp:514] Will not verify peer certificate!
NOTE: Set LIBPROCESS_SSL_VERIFY_CERT=1 to enable peer certificate verification
I1208 12:34:24.186502  4348 openssl.cpp:534] LIBPROCESS_SSL_REQUIRE_CERT implies peer certificate
verification.
LIBPROCESS_SSL_VERIFY_CERT set to true
I1208 12:34:24.187503  4348 openssl.cpp:563] Using CA file: C:\Users\mesos\AppData\Local\Temp\oaG1iU\cert.pem
I1208 12:34:24.187503  4348 openssl.cpp:566] Using CA dir: C:\Users\mesos\AppData\Local\Temp\oaG1iU
I1208 12:34:24.557680  4348 openssl.cpp:514] Will not verify peer certificate!
NOTE: Set LIBPROCESS_SSL_VERIFY_CERT=1 to enable peer certificate verification
I1208 12:34:24.557680  4348 openssl.cpp:526] Will use IP address verification in subject alternative
name certificate extension.
I1208 12:34:24.557680  4348 openssl.cpp:534] LIBPROCESS_SSL_REQUIRE_CERT implies peer certificate
verification.
LIBPROCESS_SSL_VERIFY_CERT set to true
I1208 12:34:24.578687  4348 openssl.cpp:563] Using CA file: C:\Users\mesos\AppData\Local\Temp\ObYk7N\cert.pem
I1208 12:34:24.578687  4348 openssl.cpp:566] Using CA dir: C:\Users\mesos\AppData\Local\Temp\ObYk7N
I1208 12:34:25.131894  4348 openssl.cpp:509] CA directory path unspecified! NOTE: Set CA directory
path with LIBPROCESS_SSL_CA_DIR=<dirpath>
I1208 12:34:25.131894  4348 openssl.cpp:514] Will not verify peer certificate!
NOTE: Set LIBPROCESS_SSL_VERIFY_CERT=1 to enable peer certificate verification
I1208 12:34:25.131894  4348 openssl.cpp:534] LIBPROCESS_SSL_REQUIRE_CERT implies peer certificate
verification.
LIBPROCESS_SSL_VERIFY_CERT set to true
I1208 12:34:25.131894  4348 openssl.cpp:563] Using CA file: C:\Users\mesos\AppData\Local\Temp\qr162j\cert.pem
I1208 12:34:41.873987  4348 openssl.cpp:509] CA directory path unspecified! NOTE: Set CA directory
path with LIBPROCESS_SSL_CA_DIR=<dirpath>
I1208 12:34:41.874980  4348 openssl.cpp:514] Will not verify peer certificate!
NOTE: Set LIBPROCESS_SSL_VERIFY_CERT=1 to enable peer certificate verification
I1208 12:34:41.874980  4348 openssl.cpp:526] Will use IP address verification in subject alternative
name certificate extension.
I1208 12:34:41.874980  4348 openssl.cpp:534] LIBPROCESS_SSL_REQUIRE_CERT implies peer certificate
verification.
LIBPROCESS_SSL_VERIFY_CERT set to true
I1208 12:34:41.874980  4348 openssl.cpp:563] Using CA file: C:\Users\mesos\AppData\Local\Temp\jo9VgC\cert.pem
I1208 12:34:57.975925  9332 process.cpp:887] Failed to accept socket: future discarded
```

- Mesos Reviewbot Windows


On Dec. 8, 2017, 11:32 a.m., Benjamin Bannier wrote:
> 
> -----------------------------------------------------------
> This is an automatically generated e-mail. To reply, visit:
> https://reviews.apache.org/r/64430/
> -----------------------------------------------------------
> 
> (Updated Dec. 8, 2017, 11:32 a.m.)
> 
> 
> Review request for mesos, Jie Yu and Jan Schlicht.
> 
> 
> Bugs: MESOS-8312
>     https://issues.apache.org/jira/browse/MESOS-8312
> 
> 
> Repository: mesos
> 
> 
> Description
> -------
> 
> Since we have moved all resource provider-related information like
> e.g., resource versions to an explicit field in 'UpdateSlaveMessage',
> we now only pass agent information in top-level fields.
> 
> To model that we changed the top-level resource versions there from a
> repeated field to a single optional field. This will allow us to in
> the future pass agent information in the resource provider data
> structure as well.
> 
> 
> Diffs
> -----
> 
>   src/master/master.cpp 5cba50636a9351d29660c54fad7734fcfea547b9 
>   src/messages/messages.proto f71178438660fa16aad8f290391baba7813fbff0 
>   src/slave/slave.cpp 54d8bcc035227dd6896ffa6e692a91749c0b56a6 
>   src/tests/slave_tests.cpp 07145432c35c85a755b66ba575c2a46db072ce5c 
> 
> 
> Diff: https://reviews.apache.org/r/64430/diff/2/
> 
> 
> Testing
> -------
> 
> `make check`
> 
> 
> Thanks,
> 
> Benjamin Bannier
> 
>


Mime
  • Unnamed multipart/alternative (inline, None, 0 bytes)
View raw message