mesos-reviews mailing list archives

Site index · List index
Message view « Date » · « Thread »
Top « Date » · « Thread »
From Mesos Reviewbot Windows <revi...@mesos.apache.org>
Subject Re: Review Request 64248: Added `cpp17::invoke` in <stout/cpp17.hpp>.
Date Fri, 01 Dec 2017 16:44:17 GMT

-----------------------------------------------------------
This is an automatically generated e-mail. To reply, visit:
https://reviews.apache.org/r/64248/#review192508
-----------------------------------------------------------



FAIL: Mesos libprocess-tests failed to build

Reviews applied: `['64248']`

Failed command: `cmake.exe --build . --target libprocess-tests --config Debug`

All the build artifacts available at: http://dcos-win.westus.cloudapp.azure.com/mesos-build/review/64248

Relevant logs:

- [libprocess-tests-build-cmake-stdout.log](http://dcos-win.westus.cloudapp.azure.com/mesos-build/review/64248/logs/libprocess-tests-build-cmake-stdout.log):

```
  C:\DCOS\mesos\mesos\3rdparty\stout\include\stout/windows/os.hpp(62): warning C4996: 'GetVersionExW':
was declared deprecated (compiling source file C:\DCOS\mesos\mesos\3rdparty\libprocess\src\tests\state_machine_tests.cpp)
[C:\DCOS\mesos\3rdparty\libprocess\src\tests\libprocess-tests.vcxproj]
  C:\DCOS\mesos\mesos\3rdparty\stout\include\stout/windows/os.hpp(451): warning C4996: 'GetVersionExW':
was declared deprecated (compiling source file C:\DCOS\mesos\mesos\3rdparty\libprocess\src\tests\state_machine_tests.cpp)
[C:\DCOS\mesos\3rdparty\libprocess\src\tests\libprocess-tests.vcxproj]
  C:\DCOS\mesos\mesos\3rdparty\stout\include\stout/windows/os.hpp(805): warning C4244: 'argument':
conversion from 'ULONG_PTR' to 'pid_t', possible loss of data (compiling source file C:\DCOS\mesos\mesos\3rdparty\libprocess\src\tests\state_machine_tests.cpp)
[C:\DCOS\mesos\3rdparty\libprocess\src\tests\libprocess-tests.vcxproj]
  C:\DCOS\mesos\mesos\3rdparty\stout\include\stout/windows/os.hpp(62): warning C4996: 'GetVersionExW':
was declared deprecated (compiling source file C:\DCOS\mesos\mesos\3rdparty\libprocess\src\tests\subprocess_tests.cpp)
[C:\DCOS\mesos\3rdparty\libprocess\src\tests\libprocess-tests.vcxproj]
  C:\DCOS\mesos\mesos\3rdparty\stout\include\stout/windows/os.hpp(451): warning C4996: 'GetVersionExW':
was declared deprecated (compiling source file C:\DCOS\mesos\mesos\3rdparty\libprocess\src\tests\subprocess_tests.cpp)
[C:\DCOS\mesos\3rdparty\libprocess\src\tests\libprocess-tests.vcxproj]
  C:\DCOS\mesos\mesos\3rdparty\stout\include\stout/windows/os.hpp(62): warning C4996: 'GetVersionExW':
was declared deprecated (compiling source file C:\DCOS\mesos\mesos\3rdparty\libprocess\src\tests\system_tests.cpp)
[C:\DCOS\mesos\3rdparty\libprocess\src\tests\libprocess-tests.vcxproj]
  C:\DCOS\mesos\mesos\3rdparty\stout\include\stout/windows/os.hpp(451): warning C4996: 'GetVersionExW':
was declared deprecated (compiling source file C:\DCOS\mesos\mesos\3rdparty\libprocess\src\tests\system_tests.cpp)
[C:\DCOS\mesos\3rdparty\libprocess\src\tests\libprocess-tests.vcxproj]
  C:\DCOS\mesos\mesos\3rdparty\stout\include\stout/windows/os.hpp(805): warning C4244: 'argument':
conversion from 'ULONG_PTR' to 'pid_t', possible loss of data (compiling source file C:\DCOS\mesos\mesos\3rdparty\libprocess\src\tests\subprocess_tests.cpp)
[C:\DCOS\mesos\3rdparty\libprocess\src\tests\libprocess-tests.vcxproj]
  C:\DCOS\mesos\mesos\3rdparty\stout\include\stout/windows/os.hpp(805): warning C4244: 'argument':
conversion from 'ULONG_PTR' to 'pid_t', possible loss of data (compiling source file C:\DCOS\mesos\mesos\3rdparty\libprocess\src\tests\system_tests.cpp)
[C:\DCOS\mesos\3rdparty\libprocess\src\tests\libprocess-tests.vcxproj]
  C:\DCOS\mesos\mesos\3rdparty\stout\include\stout/windows/os.hpp(62): warning C4996: 'GetVersionExW':
was declared deprecated (compiling source file C:\DCOS\mesos\mesos\3rdparty\libprocess\src\tests\time_tests.cpp)
[C:\DCOS\mesos\3rdparty\libprocess\src\tests\libprocess-tests.vcxproj]
  C:\DCOS\mesos\mesos\3rdparty\stout\include\stout/windows/os.hpp(451): warning C4996: 'GetVersionExW':
was declared deprecated (compiling source file C:\DCOS\mesos\mesos\3rdparty\libprocess\src\tests\time_tests.cpp)
[C:\DCOS\mesos\3rdparty\libprocess\src\tests\libprocess-tests.vcxproj]
  C:\DCOS\mesos\mesos\3rdparty\stout\include\stout/windows/os.hpp(805): warning C4244: 'argument':
conversion from 'ULONG_PTR' to 'pid_t', possible loss of data (compiling source file C:\DCOS\mesos\mesos\3rdparty\libprocess\src\tests\time_tests.cpp)
[C:\DCOS\mesos\3rdparty\libprocess\src\tests\libprocess-tests.vcxproj]
  C:\DCOS\mesos\mesos\3rdparty\stout\include\stout/windows/os.hpp(62): warning C4996: 'GetVersionExW':
was declared deprecated (compiling source file C:\DCOS\mesos\mesos\3rdparty\libprocess\src\tests\ssl_tests.cpp)
[C:\DCOS\mesos\3rdparty\libprocess\src\tests\libprocess-tests.vcxproj]
  C:\DCOS\mesos\mesos\3rdparty\stout\include\stout/windows/os.hpp(451): warning C4996: 'GetVersionExW':
was declared deprecated (compiling source file C:\DCOS\mesos\mesos\3rdparty\libprocess\src\tests\ssl_tests.cpp)
[C:\DCOS\mesos\3rdparty\libprocess\src\tests\libprocess-tests.vcxproj]


"C:\DCOS\mesos\3rdparty\libprocess\src\tests\libprocess-tests.vcxproj" (default target) (1)
->
(ClCompile target) -> 
  C:\DCOS\mesos\mesos\3rdparty\libprocess\include\process/ssl/gtest.hpp(355): error C2039:
'realpath': is not a member of 'os' (compiling source file C:\DCOS\mesos\mesos\3rdparty\libprocess\src\tests\http_tests.cpp)
[C:\DCOS\mesos\3rdparty\libprocess\src\tests\libprocess-tests.vcxproj]
  C:\DCOS\mesos\mesos\3rdparty\libprocess\include\process/ssl/gtest.hpp(355): error C3861:
'realpath': identifier not found (compiling source file C:\DCOS\mesos\mesos\3rdparty\libprocess\src\tests\http_tests.cpp)
[C:\DCOS\mesos\3rdparty\libprocess\src\tests\libprocess-tests.vcxproj]
  C:\DCOS\mesos\mesos\3rdparty\libprocess\include\process/ssl/gtest.hpp(355): error C2039:
'realpath': is not a member of 'os' (compiling source file C:\DCOS\mesos\mesos\3rdparty\libprocess\src\tests\socket_tests.cpp)
[C:\DCOS\mesos\3rdparty\libprocess\src\tests\libprocess-tests.vcxproj]
  C:\DCOS\mesos\mesos\3rdparty\libprocess\include\process/ssl/gtest.hpp(355): error C3861:
'realpath': identifier not found (compiling source file C:\DCOS\mesos\mesos\3rdparty\libprocess\src\tests\socket_tests.cpp)
[C:\DCOS\mesos\3rdparty\libprocess\src\tests\libprocess-tests.vcxproj]
  C:\DCOS\mesos\mesos\3rdparty\libprocess\include\process/ssl/gtest.hpp(355): error C2039:
'realpath': is not a member of 'os' (compiling source file C:\DCOS\mesos\mesos\3rdparty\libprocess\src\tests\ssl_tests.cpp)
[C:\DCOS\mesos\3rdparty\libprocess\src\tests\libprocess-tests.vcxproj]
  C:\DCOS\mesos\mesos\3rdparty\libprocess\include\process/ssl/gtest.hpp(355): error C3861:
'realpath': identifier not found (compiling source file C:\DCOS\mesos\mesos\3rdparty\libprocess\src\tests\ssl_tests.cpp)
[C:\DCOS\mesos\3rdparty\libprocess\src\tests\libprocess-tests.vcxproj]

    96 Warning(s)
    6 Error(s)

Time Elapsed 00:04:15.29
```

- [libprocess-tests-CMakeOutput.log](http://dcos-win.westus.cloudapp.azure.com/mesos-build/review/64248/logs/libprocess-tests-CMakeOutput.log):

```
  Creating directory "C:\DCOS\mesos\CMakeFiles\CMakeTmp\Debug\".

  Creating directory "cmTC_a4f3f.dir\Debug\cmTC_a4f3f.tlog\".

InitializeBuildStatus:

  Creating "cmTC_a4f3f.dir\Debug\cmTC_a4f3f.tlog\unsuccessfulbuild" because "AlwaysCreate"
was specified.

ClCompile:

  C:\Program Files (x86)\Microsoft Visual Studio\2017\Community\VC\Tools\MSVC\14.10.25017\bin\HostX64\x64\CL.exe
/c /Zi /W3 /WX- /diagnostics:classic /Od /Ob0 /D WIN32 /D _WINDOWS /D COMPILER_SUPPORTS_CXX11
/D "CMAKE_INTDIR=\"Debug\"" /D _MBCS /Gm- /EHsc /RTC1 /MDd /GS /fp:precise /Zc:wchar_t /Zc:forScope
/Zc:inline /GR /Fo"cmTC_a4f3f.dir\Debug\" /Fd"cmTC_a4f3f.dir\Debug\vc141.pdb" /Gd /TP /errorReport:queue
C:\DCOS\mesos\CMakeFiles\CMakeTmp\src.cxx

  Microsoft (R) C/C++ Optimizing Compiler Version 19.10.25019 for x64

  Copyright (C) Microsoft Corporation.  All rights reserved.

  

  cl /c /Zi /W3 /WX- /diagnostics:classic /Od /Ob0 /D WIN32 /D _WINDOWS /D COMPILER_SUPPORTS_CXX11
/D "CMAKE_INTDIR=\"Debug\"" /D _MBCS /Gm- /EHsc /RTC1 /MDd /GS /fp:precise /Zc:wchar_t /Zc:forScope
/Zc:inline /GR /Fo"cmTC_a4f3f.dir\Debug\" /Fd"cmTC_a4f3f.dir\Debug\vc141.pdb" /Gd /TP /errorReport:queue
C:\DCOS\mesos\CMakeFiles\CMakeTmp\src.cxx

  src.cxx

  

Link:

  C:\Program Files (x86)\Microsoft Visual Studio\2017\Community\VC\Tools\MSVC\14.10.25017\bin\HostX64\x64\link.exe
/ERRORREPORT:QUEUE /OUT:"C:\DCOS\mesos\CMakeFiles\CMakeTmp\Debug\cmTC_a4f3f.exe" /INCREMENTAL
/NOLOGO kernel32.lib user32.lib gdi32.lib winspool.lib shell32.lib ole32.lib oleaut32.lib
uuid.lib comdlg32.lib advapi32.lib /MANIFEST /MANIFESTUAC:"level='asInvoker' uiAccess='false'"
/manifest:embed /DEBUG /PDB:"C:/DCOS/mesos/CMakeFiles/CMakeTmp/Debug/cmTC_a4f3f.pdb" /SUBSYSTEM:CONSOLE
/TLBID:1 /DYNAMICBASE /NXCOMPAT /IMPLIB:"C:/DCOS/mesos/CMakeFiles/CMakeTmp/Debug/cmTC_a4f3f.lib"
/MACHINE:X64  /machine:x64 cmTC_a4f3f.dir\Debug\src.obj

  cmTC_a4f3f.vcxproj -> C:\DCOS\mesos\CMakeFiles\CMakeTmp\Debug\cmTC_a4f3f.exe

  cmTC_a4f3f.vcxproj -> C:/DCOS/mesos/CMakeFiles/CMakeTmp/Debug/cmTC_a4f3f.pdb (Full PDB)

FinalizeBuildStatus:

  Deleting file "cmTC_a4f3f.dir\Debug\cmTC_a4f3f.tlog\unsuccessfulbuild".

  Touching "cmTC_a4f3f.dir\Debug\cmTC_a4f3f.tlog\cmTC_a4f3f.lastbuildstate".

Done Building Project "C:\DCOS\mesos\CMakeFiles\CMakeTmp\cmTC_a4f3f.vcxproj" (default targets).



Build succeeded.

    0 Warning(s)

    0 Error(s)



Time Elapsed 00:00:01.70


Source file was:
int main() { return 0; }
```

- [libprocess-tests-CMakeError.log](http://dcos-win.westus.cloudapp.azure.com/mesos-build/review/64248/logs/libprocess-tests-CMakeError.log):

```
PrepareForBuild:

  Creating directory "cmTC_ba0bc.dir\Debug\".

  Creating directory "C:\DCOS\mesos\CMakeFiles\CMakeTmp\Debug\".

  Creating directory "cmTC_ba0bc.dir\Debug\cmTC_ba0bc.tlog\".

InitializeBuildStatus:

  Creating "cmTC_ba0bc.dir\Debug\cmTC_ba0bc.tlog\unsuccessfulbuild" because "AlwaysCreate"
was specified.

ClCompile:

  C:\Program Files (x86)\Microsoft Visual Studio\2017\Community\VC\Tools\MSVC\14.10.25017\bin\HostX64\x64\CL.exe
/c /Zi /W3 /WX- /diagnostics:classic /MP /Od /Ob0 /D WIN32 /D _WINDOWS /D UNICODE /D _UNICODE
/D "CMAKE_INTDIR=\"Debug\"" /D _UNICODE /D UNICODE /Gm- /RTC1 /MTd /GS /fp:precise /Zc:wchar_t
/Zc:forScope /Zc:inline /Fo"cmTC_ba0bc.dir\Debug\" /Fd"cmTC_ba0bc.dir\Debug\vc141.pdb" /Gd
/TC /errorReport:queue C:\DCOS\mesos\CMakeFiles\CMakeTmp\CheckIncludeFile.c

  Microsoft (R) C/C++ Optimizing Compiler Version 19.10.25019 for x64

  Copyright (C) Microsoft Corporation.  All rights reserved.

  

  cl /c /Zi /W3 /WX- /diagnostics:classic /MP /Od /Ob0 /D WIN32 /D _WINDOWS /D UNICODE /D
_UNICODE /D "CMAKE_INTDIR=\"Debug\"" /D _UNICODE /D UNICODE /Gm- /RTC1 /MTd /GS /fp:precise
/Zc:wchar_t /Zc:forScope /Zc:inline /Fo"cmTC_ba0bc.dir\Debug\" /Fd"cmTC_ba0bc.dir\Debug\vc141.pdb"
/Gd /TC /errorReport:queue C:\DCOS\mesos\CMakeFiles\CMakeTmp\CheckIncludeFile.c

  CheckIncludeFile.c

  

C:\DCOS\mesos\CMakeFiles\CMakeTmp\CheckIncludeFile.c(1): fatal error C1083: Cannot open include
file: 'pthread.h': No such file or directory [C:\DCOS\mesos\CMakeFiles\CMakeTmp\cmTC_ba0bc.vcxproj]

Done Building Project "C:\DCOS\mesos\CMakeFiles\CMakeTmp\cmTC_ba0bc.vcxproj" (default targets)
-- FAILED.



Build FAILED.



"C:\DCOS\mesos\CMakeFiles\CMakeTmp\cmTC_ba0bc.vcxproj" (default target) (1) ->

(ClCompile target) -> 

  C:\DCOS\mesos\CMakeFiles\CMakeTmp\CheckIncludeFile.c(1): fatal error C1083: Cannot open
include file: 'pthread.h': No such file or directory [C:\DCOS\mesos\CMakeFiles\CMakeTmp\cmTC_ba0bc.vcxproj]



    0 Warning(s)

    1 Error(s)



Time Elapsed 00:00:01.11



```

- Mesos Reviewbot Windows


On Dec. 1, 2017, 3:36 p.m., Michael Park wrote:
> 
> -----------------------------------------------------------
> This is an automatically generated e-mail. To reply, visit:
> https://reviews.apache.org/r/64248/
> -----------------------------------------------------------
> 
> (Updated Dec. 1, 2017, 3:36 p.m.)
> 
> 
> Review request for mesos and Dmitry Zhuk.
> 
> 
> Repository: mesos
> 
> 
> Description
> -------
> 
> See summary.
> 
> 
> Diffs
> -----
> 
>   3rdparty/stout/Makefile.am 4386017acd6ca465be3f735460c11d50b440ccc5 
>   3rdparty/stout/include/stout/cpp17.hpp PRE-CREATION 
>   3rdparty/stout/tests/CMakeLists.txt 6e5773f1e03671de7ac007caf49edd0f1cd7aedd 
>   3rdparty/stout/tests/cpp17_tests.cpp PRE-CREATION 
> 
> 
> Diff: https://reviews.apache.org/r/64248/diff/1/
> 
> 
> Testing
> -------
> 
> Added `cpp17_tests.cpp`
> 
> 
> Thanks,
> 
> Michael Park
> 
>


Mime
  • Unnamed multipart/alternative (inline, None, 0 bytes)
View raw message