mesos-reviews mailing list archives

Site index · List index
Message view « Date » · « Thread »
Top « Date » · « Thread »
From Mesos Reviewbot Windows <revi...@mesos.apache.org>
Subject Re: Review Request 60471: Added tests for pruneImages for containerizer and provisioner.
Date Thu, 16 Nov 2017 07:48:28 GMT

-----------------------------------------------------------
This is an automatically generated e-mail. To reply, visit:
https://reviews.apache.org/r/60471/#review191159
-----------------------------------------------------------



FAIL: Some Mesos libprocess-tests failed.

Reviews applied: `['55334', '55335', '59687', '62997', '56721', '56722', '62853', '60471']`

Failed command: `C:\DCOS\mesos\3rdparty\libprocess\src\tests\Debug\libprocess-tests.exe`

All the build artifacts available at: http://dcos-win.westus.cloudapp.azure.com/mesos-build/review/60471

Relevant logs:

- [libprocess-tests-stdout.log](http://dcos-win.westus.cloudapp.azure.com/mesos-build/review/60471/logs/libprocess-tests-stdout.log):

```
[       OK ] SSLVerifyIPAdd/SSLTest.RequireCertificate/0 (1374 ms)
[ RUN      ] SSLVerifyIPAdd/SSLTest.RequireCertificate/1
C:\DCOS\mesos\mesos\3rdparty\libprocess\src\tests\ssl_tests.cpp(446): error: (await_subprocess(client.get(),
0)).failure(): 
[++++++++++] Subprocess output.
[==========] Running 1 test from 1 test case.

[----------] Global test environment set-up.

[----------] 1 test from SSLClientTest

[ RUN      ] SSLClientTest.client

[       OK ] SSLClientTest.client (21 ms)

[----------] 1 test from SSLClientTest (21 ms total)



[----------] Global test environment tear-down

[==========] 1 test from 1 test case ran. (22 ms total)

[  PASSED  ] 1 test.

[++++++++++]

[  FAILED  ] SSLVerifyIPAdd/SSLTest.RequireCertificate/1, where GetParam() = "true" (1017
ms)
[----------] 4 tests from SSLVerifyIPAdd/SSLTest (4731 ms total)

[----------] Global test environment tear-down
[==========] 201 tests from 33 test cases ran. (49240 ms total)
[  PASSED  ] 199 tests.
[  FAILED  ] 2 tests, listed below:
[  FAILED  ] SSLTest.VerifyCertificate
[  FAILED  ] SSLVerifyIPAdd/SSLTest.RequireCertificate/1, where GetParam() = "true"

 2 FAILED TESTS
  YOU HAVE 19 DISABLED TESTS

```

- [libprocess-tests-stderr.log](http://dcos-win.westus.cloudapp.azure.com/mesos-build/review/60471/logs/libprocess-tests-stderr.log):

```
I1116 07:47:55.984385  2084 openssl.cpp:509] CA directory path unspecified! NOTE: Set CA directory
path with LIBPROCESS_SSL_CA_DIR=<dirpath>
I1116 07:47:55.984385  2084 openssl.cpp:514] Will not verify peer certificate!
NOTE: Set LIBPROCESS_SSL_VERIFY_CERT=1 to enable peWARNING: Logging before InitGoogleLogging()
is written to STDERR
I1116 07:47:56.333386  5560 openssl.cpp:509] CA directory path unspecified! NOTE: Set CA directory
path with LIBPROCESS_SSL_CA_DIR=<dirpath>
I1116 07:47:56.334388  5560 openssl.cpp:514] Will not verify peer certificate!
NOTE: Set LIBPROCESS_SSL_VERIFY_CERT=1 to enable peer certificate verification
I1116 07:47:56.334388  5560 openssl.cpp:534] LIBPROCESS_SSL_REQUIRE_CERT implies peer certificate
verification.
LIBPROCESS_SSL_VERIFY_CERT set to true
I1116 07:47:56.335388  5560 openssl.cpp:563] Using CA file: C:\Users\mesos\AppData\Local\Temp\MxjpV5\cert.pem
WARNING: Logging before InitGoogleLogging() is written to STDERR
I1116 07:47:57.327318  3356 openssl.cpp:509] CA directory path unspecified! NOTE: Set CA directory
path with LIBPROCESS_SSL_CA_DIR=<dirpath>
I1116 07:47:57.328320  3356 openssl.cpp:514] Will not verify peer certificate!
NOTE: Set LIBPROCESS_SSL_VERIFY_CERT=1 to enable peer certificate verification
I1116 07:47:57.329620  3356 openssl.cpp:526] Will use IP address verification in subject alternative
name certificate extension.
I1116 07:47:57.329620  3356 openssl.cpp:534] LIBPROCESS_SSL_REQUIRE_CERT implies peer certificate
verification.
LIBPROCESS_SSL_VERIFY_CERT set to true
I1116 07:47:57.330322  3356 openssl.cpp:563] Using CA file: C:\Users\mesos\AppData\Local\Temp\nsdOec\cert.pem
er certificate verification
I1116 07:47:56.012396  2084 openssl.cpp:534] LIBPROCESS_SSL_REQUIRE_CERT implies peer certificate
verification.
LIBPROCESS_SSL_VERIFY_CERT set to true
I1116 07:47:56.013386  2084 openssl.cpp:563] Using CA file: C:\Users\mesos\AppData\Local\Temp\MxjpV5\cert.pem
I1116 07:47:57.018337  2084 openssl.cpp:509] CA directory path unspecified! NOTE: Set CA directory
path with LIBPROCESS_SSL_CA_DIR=<dirpath>
I1116 07:47:57.019317  2084 openssl.cpp:514] Will not verify peer certificate!
NOTE: Set LIBPROCESS_SSL_VERIFY_CERT=1 to enable peer certificate verification
I1116 07:47:57.019317  2084 openssl.cpp:526] Will use IP address verification in subject alternative
name certificate extension.
I1116 07:47:57.019317  2084 openssl.cpp:534] LIBPROCESS_SSL_REQUIRE_CERT implies peer certificate
verification.
LIBPROCESS_SSL_VERIFY_CERT set to true
I1116 07:47:57.019317  2084 openssl.cpp:563] Using CA file: C:\Users\mesos\AppData\Local\Temp\nsdOec\cert.pem
I1116 07:47:57.654356   408 process.cpp:1052] Failed to accept socket: future discarded
```

- Mesos Reviewbot Windows


On Nov. 16, 2017, 4:05 a.m., Zhitao Li wrote:
> 
> -----------------------------------------------------------
> This is an automatically generated e-mail. To reply, visit:
> https://reviews.apache.org/r/60471/
> -----------------------------------------------------------
> 
> (Updated Nov. 16, 2017, 4:05 a.m.)
> 
> 
> Review request for mesos, Gilbert Song and Jason Lai.
> 
> 
> Bugs: MESOS-4945
>     https://issues.apache.org/jira/browse/MESOS-4945
> 
> 
> Repository: mesos
> 
> 
> Description
> -------
> 
> Added tests for pruneImages for containerizer and provisioner.
> 
> 
> Diffs
> -----
> 
>   src/tests/containerizer/mesos_containerizer_tests.cpp ce67def65aa65188aff10f5316fcd8b745d0abf2

>   src/tests/containerizer/provisioner_docker_tests.cpp 832c81fe88d753b0f00dfab870d7725cf556fcef

> 
> 
> Diff: https://reviews.apache.org/r/60471/diff/9/
> 
> 
> Testing
> -------
> 
> 
> Thanks,
> 
> Zhitao Li
> 
>


Mime
  • Unnamed multipart/alternative (inline, None, 0 bytes)
View raw message