mesos-reviews mailing list archives

Site index · List index
Message view « Date » · « Thread »
Top « Date » · « Thread »
From Mesos Reviewbot Windows <revi...@mesos.apache.org>
Subject Re: Review Request 63853: Added the "task" prefix to the name of the status update manager files.
Date Thu, 16 Nov 2017 06:52:04 GMT

-----------------------------------------------------------
This is an automatically generated e-mail. To reply, visit:
https://reviews.apache.org/r/63853/#review191155
-----------------------------------------------------------



FAIL: Mesos failed to build.

Reviews applied: `['63852', '63853']`

Failed command: `cmake.exe C:\DCOS\mesos\mesos -G "Visual Studio 15 2017 Win64" -T host=x64
-DENABLE_LIBEVENT=ON -DHAS_AUTHENTICATION=ON -DENABLE_JAVA=ON -DENABLE_SSL=ON`

All the build artifacts available at: http://dcos-win.westus.cloudapp.azure.com/mesos-build/review/63853

Relevant logs:

- [mesos-build-cmake-stdout.log](http://dcos-win.westus.cloudapp.azure.com/mesos-build/review/63853/logs/mesos-build-cmake-stdout.log):

```
-- Detecting CXX compiler ABI info - done
-- Detecting CXX compile features
-- Detecting CXX compile features - done
-- cotire 1.7.10 loaded.
-- ************************************************************
-- ********* Beginning Mesos CMake configuration step *********
-- ************************************************************
-- INSTALLATION PREFIX: C:/Program Files/Mesos
-- MACHINE SPECS:
--     Hostname: 
--     OS:       WINDOWS(10.0.14393)
--     Arch:     AMD64
--     BitMode:  
--     BuildID:  
-- ************************************************************
-- Found Java: C:/Program Files/Java/jdk1.8.0_151/bin/java.exe (found version "1.8.0.151")

-- Found Java: C:/Program Files/Java/jdk1.8.0_151/bin/java.exe (found version "1.8.0.151")
found components:  Development 
-- Found JNI: C:/Program Files/Java/jdk1.8.0_151/lib/jawt.lib  
-- Performing Test COMPILER_SUPPORTS_CXX11
-- Performing Test COMPILER_SUPPORTS_CXX11 - Success
-- GnuWin32 patch.exe exists at: C:/Program Files (x86)/GnuWin32/bin/patch.exe
-- Looking for pthread.h
-- Looking for pthread.h - not found
-- Found Threads: TRUE  
-- Found OpenSSL: optimized;C:/OpenSSL-Win64/lib/VC/libeay32MT.lib;debug;C:/OpenSSL-Win64/lib/VC/libeay32MTd.lib
(found version "1.0.2l") 
-- CXX target mesos cotired without unity build.
-- Configuring done
-- Generating done
-- Build files have been written to: C:/DCOS/mesos
```

- [mesos-build-cmake-stderr.log](http://dcos-win.westus.cloudapp.azure.com/mesos-build/review/63853/logs/mesos-build-cmake-stderr.log):

```
  On Windows, the required versions of:

    * curl
    * apr
    * zlib
    * glog

  do not come rebundled in the Mesos repository.  They will be downloaded
  from the Internet, even though the `REBUNDLED` flag was set.
Call Stack (most recent call first):
  cmake/MesosConfigure.cmake:51 (include)
  CMakeLists.txt:48 (include)


CMake Error at src/tests/CMakeLists.txt:253 (add_executable):
  Cannot find source file:

    status_update_manager_tests.cpp

  Tried extensions .c .C .c++ .cc .cpp .cxx .m .M .mm .h .hh .h++ .hm .hpp
  .hxx .in .txx


CMake Warning:
  Manually-specified variables were not used by the project:

    HAS_AUTHENTICATION


```

- [mesos-build-CMakeOutput.log](http://dcos-win.westus.cloudapp.azure.com/mesos-build/review/63853/logs/mesos-build-CMakeOutput.log):

```
  Creating directory "C:\DCOS\mesos\CMakeFiles\CMakeTmp\Debug\".

  Creating directory "cmTC_779ee.dir\Debug\cmTC_779ee.tlog\".

InitializeBuildStatus:

  Creating "cmTC_779ee.dir\Debug\cmTC_779ee.tlog\unsuccessfulbuild" because "AlwaysCreate"
was specified.

ClCompile:

  C:\Program Files (x86)\Microsoft Visual Studio\2017\Community\VC\Tools\MSVC\14.10.25017\bin\HostX64\x64\CL.exe
/c /Zi /W3 /WX- /diagnostics:classic /Od /Ob0 /D WIN32 /D _WINDOWS /D COMPILER_SUPPORTS_CXX11
/D "CMAKE_INTDIR=\"Debug\"" /D _MBCS /Gm- /EHsc /RTC1 /MDd /GS /fp:precise /Zc:wchar_t /Zc:forScope
/Zc:inline /GR /Fo"cmTC_779ee.dir\Debug\" /Fd"cmTC_779ee.dir\Debug\vc141.pdb" /Gd /TP /errorReport:queue
C:\DCOS\mesos\CMakeFiles\CMakeTmp\src.cxx

  Microsoft (R) C/C++ Optimizing Compiler Version 19.10.25019 for x64

  Copyright (C) Microsoft Corporation.  All rights reserved.

  

  cl /c /Zi /W3 /WX- /diagnostics:classic /Od /Ob0 /D WIN32 /D _WINDOWS /D COMPILER_SUPPORTS_CXX11
/D "CMAKE_INTDIR=\"Debug\"" /D _MBCS /Gm- /EHsc /RTC1 /MDd /GS /fp:precise /Zc:wchar_t /Zc:forScope
/Zc:inline /GR /Fo"cmTC_779ee.dir\Debug\" /Fd"cmTC_779ee.dir\Debug\vc141.pdb" /Gd /TP /errorReport:queue
C:\DCOS\mesos\CMakeFiles\CMakeTmp\src.cxx

  src.cxx

  

Link:

  C:\Program Files (x86)\Microsoft Visual Studio\2017\Community\VC\Tools\MSVC\14.10.25017\bin\HostX64\x64\link.exe
/ERRORREPORT:QUEUE /OUT:"C:\DCOS\mesos\CMakeFiles\CMakeTmp\Debug\cmTC_779ee.exe" /INCREMENTAL
/NOLOGO kernel32.lib user32.lib gdi32.lib winspool.lib shell32.lib ole32.lib oleaut32.lib
uuid.lib comdlg32.lib advapi32.lib /MANIFEST /MANIFESTUAC:"level='asInvoker' uiAccess='false'"
/manifest:embed /DEBUG /PDB:"C:/DCOS/mesos/CMakeFiles/CMakeTmp/Debug/cmTC_779ee.pdb" /SUBSYSTEM:CONSOLE
/TLBID:1 /DYNAMICBASE /NXCOMPAT /IMPLIB:"C:/DCOS/mesos/CMakeFiles/CMakeTmp/Debug/cmTC_779ee.lib"
/MACHINE:X64  /machine:x64 cmTC_779ee.dir\Debug\src.obj

  cmTC_779ee.vcxproj -> C:\DCOS\mesos\CMakeFiles\CMakeTmp\Debug\cmTC_779ee.exe

  cmTC_779ee.vcxproj -> C:/DCOS/mesos/CMakeFiles/CMakeTmp/Debug/cmTC_779ee.pdb (Full PDB)

FinalizeBuildStatus:

  Deleting file "cmTC_779ee.dir\Debug\cmTC_779ee.tlog\unsuccessfulbuild".

  Touching "cmTC_779ee.dir\Debug\cmTC_779ee.tlog\cmTC_779ee.lastbuildstate".

Done Building Project "C:\DCOS\mesos\CMakeFiles\CMakeTmp\cmTC_779ee.vcxproj" (default targets).



Build succeeded.

    0 Warning(s)

    0 Error(s)



Time Elapsed 00:00:01.85


Source file was:
int main() { return 0; }
```

- [mesos-build-CMakeError.log](http://dcos-win.westus.cloudapp.azure.com/mesos-build/review/63853/logs/mesos-build-CMakeError.log):

```
PrepareForBuild:

  Creating directory "cmTC_b6aea.dir\Debug\".

  Creating directory "C:\DCOS\mesos\CMakeFiles\CMakeTmp\Debug\".

  Creating directory "cmTC_b6aea.dir\Debug\cmTC_b6aea.tlog\".

InitializeBuildStatus:

  Creating "cmTC_b6aea.dir\Debug\cmTC_b6aea.tlog\unsuccessfulbuild" because "AlwaysCreate"
was specified.

ClCompile:

  C:\Program Files (x86)\Microsoft Visual Studio\2017\Community\VC\Tools\MSVC\14.10.25017\bin\HostX64\x64\CL.exe
/c /Zi /W3 /WX- /diagnostics:classic /MP /Od /Ob0 /D WIN32 /D _WINDOWS /D UNICODE /D _UNICODE
/D "CMAKE_INTDIR=\"Debug\"" /D _UNICODE /D UNICODE /Gm- /RTC1 /MTd /GS /fp:precise /Zc:wchar_t
/Zc:forScope /Zc:inline /Fo"cmTC_b6aea.dir\Debug\" /Fd"cmTC_b6aea.dir\Debug\vc141.pdb" /Gd
/TC /errorReport:queue C:\DCOS\mesos\CMakeFiles\CMakeTmp\CheckIncludeFile.c

  Microsoft (R) C/C++ Optimizing Compiler Version 19.10.25019 for x64

  Copyright (C) Microsoft Corporation.  All rights reserved.

  

  cl /c /Zi /W3 /WX- /diagnostics:classic /MP /Od /Ob0 /D WIN32 /D _WINDOWS /D UNICODE /D
_UNICODE /D "CMAKE_INTDIR=\"Debug\"" /D _UNICODE /D UNICODE /Gm- /RTC1 /MTd /GS /fp:precise
/Zc:wchar_t /Zc:forScope /Zc:inline /Fo"cmTC_b6aea.dir\Debug\" /Fd"cmTC_b6aea.dir\Debug\vc141.pdb"
/Gd /TC /errorReport:queue C:\DCOS\mesos\CMakeFiles\CMakeTmp\CheckIncludeFile.c

  CheckIncludeFile.c

  

C:\DCOS\mesos\CMakeFiles\CMakeTmp\CheckIncludeFile.c(1): fatal error C1083: Cannot open include
file: 'pthread.h': No such file or directory [C:\DCOS\mesos\CMakeFiles\CMakeTmp\cmTC_b6aea.vcxproj]

Done Building Project "C:\DCOS\mesos\CMakeFiles\CMakeTmp\cmTC_b6aea.vcxproj" (default targets)
-- FAILED.



Build FAILED.



"C:\DCOS\mesos\CMakeFiles\CMakeTmp\cmTC_b6aea.vcxproj" (default target) (1) ->

(ClCompile target) -> 

  C:\DCOS\mesos\CMakeFiles\CMakeTmp\CheckIncludeFile.c(1): fatal error C1083: Cannot open
include file: 'pthread.h': No such file or directory [C:\DCOS\mesos\CMakeFiles\CMakeTmp\cmTC_b6aea.vcxproj]



    0 Warning(s)

    1 Error(s)



Time Elapsed 00:00:01.39



```

- Mesos Reviewbot Windows


On Nov. 15, 2017, 3:42 p.m., Gaston Kleiman wrote:
> 
> -----------------------------------------------------------
> This is an automatically generated e-mail. To reply, visit:
> https://reviews.apache.org/r/63853/
> -----------------------------------------------------------
> 
> (Updated Nov. 15, 2017, 3:42 p.m.)
> 
> 
> Review request for mesos and Greg Mann.
> 
> 
> Bugs: MESOS-8197
>     https://issues.apache.org/jira/browse/MESOS-8197
> 
> 
> Repository: mesos
> 
> 
> Description
> -------
> 
> Added the "task" prefix to the name of the status update manager files.
> 
> 
> Diffs
> -----
> 
>   src/CMakeLists.txt 4f114184df067f4438c852cff4a40fa01861316a 
>   src/Makefile.am 49dec55ced32945ad0414c32eb4e00247f4b54f2 
>   src/local/local.cpp 99c1b087d75a1759ed61a4e6178e15919bee1e77 
>   src/slave/main.cpp 94431b036524ef4db16a594c80f45b64a45728f7 
>   src/slave/slave.cpp d8edc5e6bbfa265bca4d19bbaa7db3063949dbc0 
>   src/slave/status_update_manager.hpp 14ead42f22e342d03c117eabe7af635b48052703 
>   src/slave/status_update_manager.cpp e0d029b855de1024882a0db3c2556523240179e5 
>   src/tests/cluster.hpp 65634121b7fe076a7cd9a1c5aa6101a96b1c009d 
>   src/tests/cluster.cpp d657da6d84e5ea28e0dad180dce069de569c5d38 
>   src/tests/mock_slave.cpp db24f9e5b71f558d2f811f0da8a9cc9c7c2dd341 
>   src/tests/status_update_manager_tests.cpp 24d6a9951b164369b2a5875e1c54b7e69e22d66b

> 
> 
> Diff: https://reviews.apache.org/r/63853/diff/1/
> 
> 
> Testing
> -------
> 
> Tests still pass on GNU/Linux.
> 
> 
> Thanks,
> 
> Gaston Kleiman
> 
>


Mime
  • Unnamed multipart/alternative (inline, None, 0 bytes)
View raw message