mesos-reviews mailing list archives

Site index · List index
Message view « Date » · « Thread »
Top « Date » · « Thread »
From Mesos Reviewbot Windows <revi...@mesos.apache.org>
Subject Re: Review Request 63796: Made `CheckerProcess` support IPv6 for HTTP/TCP check.
Date Tue, 14 Nov 2017 22:04:56 GMT

-----------------------------------------------------------
This is an automatically generated e-mail. To reply, visit:
https://reviews.apache.org/r/63796/#review191006
-----------------------------------------------------------



FAIL: Some Mesos libprocess-tests failed.

Reviews applied: `['63794', '63795', '63796']`

Failed command: `C:\DCOS\mesos\3rdparty\libprocess\src\tests\Debug\libprocess-tests.exe`

All the build artifacts available at: http://dcos-win.westus.cloudapp.azure.com/mesos-build/review/63796

Relevant logs:

- [libprocess-tests-stdout.log](http://dcos-win.westus.cloudapp.azure.com/mesos-build/review/63796/logs/libprocess-tests-stdout.log):

```
[       OK ] Scheme/HTTPTest.WWWAuthenticateHeader/0 (683 ms)
[ RUN      ] Scheme/HTTPTest.WWWAuthenticateHeader/1
[       OK ] Scheme/HTTPTest.WWWAuthenticateHeader/1 (77 ms)
[ RUN      ] Scheme/HTTPTest.Accepts/0
[       OK ] Scheme/HTTPTest.Accepts/0 (448 ms)
[ RUN      ] Scheme/HTTPTest.Accepts/1
[       OK ] Scheme/HTTPTest.Accepts/1 (102 ms)
[----------] 34 tests from Scheme/HTTPTest (14148 ms total)

[----------] 4 tests from SSLVerifyIPAdd/SSLTest
[ RUN      ] SSLVerifyIPAdd/SSLTest.BasicSameProcess/0
[       OK ] SSLVerifyIPAdd/SSLTest.BasicSameProcess/0 (418 ms)
[ RUN      ] SSLVerifyIPAdd/SSLTest.BasicSameProcess/1
[       OK ] SSLVerifyIPAdd/SSLTest.BasicSameProcess/1 (1134 ms)
[ RUN      ] SSLVerifyIPAdd/SSLTest.RequireCertificate/0
[       OK ] SSLVerifyIPAdd/SSLTest.RequireCertificate/0 (1193 ms)
[ RUN      ] SSLVerifyIPAdd/SSLTest.RequireCertificate/1
[       OK ] SSLVerifyIPAdd/SSLTest.RequireCertificate/1 (950 ms)
[----------] 4 tests from SSLVerifyIPAdd/SSLTest (3791 ms total)

[----------] Global test environment tear-down
[==========] 201 tests from 33 test cases ran. (45647 ms total)
[  PASSED  ] 200 tests.
[  FAILED  ] 1 test, listed below:
[  FAILED  ] SSLTest.ProtocolMismatch

 1 FAILED TEST
  YOU HAVE 19 DISABLED TESTS

```

- [libprocess-tests-stderr.log](http://dcos-win.westus.cloudapp.azure.com/mesos-build/review/63796/logs/libprocess-tests-stderr.log):

```
I1114 22:04:18.386386  1016 openssl.cpp:509] CA directory path unspecified! NOTE: Set CA directory
path with LIBPROCESS_SSL_CA_DIR=<dirpath>
I1114 22:04:18.386386  1016 openssl.cpp:514] Will not verify peer certificate!
NOTE: Set LIBPROCESS_SSL_VERIFY_CERT=1 to enable peWARNING: Logging before InitGoogleLogging()
is written to STDERR
I1114 22:04:18.689396  1428 openssl.cpp:509] CA directory path unspecified! NOTE: Set CA directory
path with LIBPROCESS_SSL_CA_DIR=<dirpath>
I1114 22:04:18.690397  1428 openssl.cpp:514] Will not verify peer certificate!
NOTE: Set LIBPROCESS_SSL_VERIFY_CERT=1 to enable peer certificate verification
I1114 22:04:18.690397  1428 openssl.cpp:534] LIBPROCESS_SSL_REQUIRE_CERT implies peer certificate
verification.
LIBPROCESS_SSL_VERIFY_CERT set to true
I1114 22:04:18.696396  1428 openssl.cpp:563] Using CA file: C:\Users\mesos\AppData\Local\Temp\LAwIJC\cert.pem
WARNING: Logging before InitGoogleLogging() is written to STDERR
I1114 22:04:19.719311  2776 openssl.cpp:509] CA directory path unspecified! NOTE: Set CA directory
path with LIBPROCESS_SSL_CA_DIR=<dirpath>
I1114 22:04:19.720314  2776 openssl.cpp:514] Will not verify peer certificate!
NOTE: Set LIBPROCESS_SSL_VERIFY_CERT=1 to enable peer certificate verification
I1114 22:04:19.720314  2776 openssl.cpp:526] Will use IP address verification in subject alternative
name certificate extension.
I1114 22:04:19.720314  2776 openssl.cpp:534] LIBPROCESS_SSL_REQUIRE_CERT implies peer certificate
verification.
LIBPROCESS_SSL_VERIFY_CERT set to true
I1114 22:04:19.721314  2776 openssl.cpp:563] Using CA file: C:\Users\mesos\AppData\Local\Temp\7aFJSF\cert.pem
er certificate verification
I1114 22:04:18.402449  1016 openssl.cpp:534] LIBPROCESS_SSL_REQUIRE_CERT implies peer certificate
verification.
LIBPROCESS_SSL_VERIFY_CERT set to true
I1114 22:04:18.403388  1016 openssl.cpp:563] Using CA file: C:\Users\mesos\AppData\Local\Temp\LAwIJC\cert.pem
I1114 22:04:19.413309  1016 openssl.cpp:509] CA directory path unspecified! NOTE: Set CA directory
path with LIBPROCESS_SSL_CA_DIR=<dirpath>
I1114 22:04:19.413309  1016 openssl.cpp:514] Will not verify peer certificate!
NOTE: Set LIBPROCESS_SSL_VERIFY_CERT=1 to enable peer certificate verification
I1114 22:04:19.413309  1016 openssl.cpp:526] Will use IP address verification in subject alternative
name certificate extension.
I1114 22:04:19.413309  1016 openssl.cpp:534] LIBPROCESS_SSL_REQUIRE_CERT implies peer certificate
verification.
LIBPROCESS_SSL_VERIFY_CERT set to true
I1114 22:04:19.414309  1016 openssl.cpp:563] Using CA file: C:\Users\mesos\AppData\Local\Temp\7aFJSF\cert.pem
I1114 22:04:19.901316  2760 process.cpp:1052] Failed to accept socket: future discarded
```

- Mesos Reviewbot Windows


On Nov. 14, 2017, 2:31 p.m., Qian Zhang wrote:
> 
> -----------------------------------------------------------
> This is an automatically generated e-mail. To reply, visit:
> https://reviews.apache.org/r/63796/
> -----------------------------------------------------------
> 
> (Updated Nov. 14, 2017, 2:31 p.m.)
> 
> 
> Review request for mesos, Alexander Rukletsov and Avinash sridharan.
> 
> 
> Bugs: MESOS-8050
>     https://issues.apache.org/jira/browse/MESOS-8050
> 
> 
> Repository: mesos
> 
> 
> Description
> -------
> 
> Made `CheckerProcess` support IPv6 for HTTP/TCP check.
> 
> 
> Diffs
> -----
> 
>   src/checks/checker_process.cpp 7985e8d4dc6115f81a4daef0ce4eee67f4233c9f 
> 
> 
> Diff: https://reviews.apache.org/r/63796/diff/1/
> 
> 
> Testing
> -------
> 
> sudo make check
> 
> 
> Thanks,
> 
> Qian Zhang
> 
>


Mime
  • Unnamed multipart/alternative (inline, None, 0 bytes)
View raw message