mesos-reviews mailing list archives

Site index · List index
Message view « Date » · « Thread »
Top « Date » · « Thread »
From Mesos Reviewbot Windows <revi...@mesos.apache.org>
Subject Re: Review Request 63661: Updated tests to use `createCallSubscribe`.
Date Wed, 08 Nov 2017 11:46:35 GMT

-----------------------------------------------------------
This is an automatically generated e-mail. To reply, visit:
https://reviews.apache.org/r/63661/#review190440
-----------------------------------------------------------



FAIL: Some Mesos libprocess-tests failed.

Reviews applied: `['63661']`

Failed command: `C:\DCOS\mesos\3rdparty\libprocess\src\tests\Debug\libprocess-tests.exe`

All the build artifacts available at: http://dcos-win.westus.cloudapp.azure.com/mesos-build/review/63661

Relevant logs:

- [libprocess-tests-stdout.log](http://dcos-win.westus.cloudapp.azure.com/mesos-build/review/63661/logs/libprocess-tests-stdout.log):

```
[       OK ] Scheme/HTTPTest.WWWAuthenticateHeader/0 (383 ms)
[ RUN      ] Scheme/HTTPTest.WWWAuthenticateHeader/1
[       OK ] Scheme/HTTPTest.WWWAuthenticateHeader/1 (76 ms)
[ RUN      ] Scheme/HTTPTest.Accepts/0
[       OK ] Scheme/HTTPTest.Accepts/0 (730 ms)
[ RUN      ] Scheme/HTTPTest.Accepts/1
[       OK ] Scheme/HTTPTest.Accepts/1 (91 ms)
[----------] 34 tests from Scheme/HTTPTest (14412 ms total)

[----------] 4 tests from SSLVerifyIPAdd/SSLTest
[ RUN      ] SSLVerifyIPAdd/SSLTest.BasicSameProcess/0
[       OK ] SSLVerifyIPAdd/SSLTest.BasicSameProcess/0 (565 ms)
[ RUN      ] SSLVerifyIPAdd/SSLTest.BasicSameProcess/1
[       OK ] SSLVerifyIPAdd/SSLTest.BasicSameProcess/1 (415 ms)
[ RUN      ] SSLVerifyIPAdd/SSLTest.RequireCertificate/0
[       OK ] SSLVerifyIPAdd/SSLTest.RequireCertificate/0 (878 ms)
[ RUN      ] SSLVerifyIPAdd/SSLTest.RequireCertificate/1
[       OK ] SSLVerifyIPAdd/SSLTest.RequireCertificate/1 (1290 ms)
[----------] 4 tests from SSLVerifyIPAdd/SSLTest (3232 ms total)

[----------] Global test environment tear-down
[==========] 201 tests from 33 test cases ran. (47573 ms total)
[  PASSED  ] 200 tests.
[  FAILED  ] 1 test, listed below:
[  FAILED  ] SSLTest.SSLSocket

 1 FAILED TEST
  YOU HAVE 19 DISABLED TESTS

```

- [libprocess-tests-stderr.log](http://dcos-win.westus.cloudapp.azure.com/mesos-build/review/63661/logs/libprocess-tests-stderr.log):

```
I1108 11:46:00.826416  2492 openssl.cpp:509] CA directory path unspecified! NOTE: Set CA directory
path with LIBPROCESS_SSL_CA_DIR=<dirpath>
I1108 11:46:00.826416  2492 openssl.cpp:514] Will not verify peer certificate!
NOTE: Set LIBPROCESS_SSL_VERIFY_CERT=1 to enable peWARNING: Logging before InitGoogleLogging()
is written to STDERR
I1108 11:46:01.164433  4300 openssl.cpp:509] CA directory path unspecified! NOTE: Set CA directory
path with LIBPROCESS_SSL_CA_DIR=<dirpath>
I1108 11:46:01.165429  4300 openssl.cpp:514] Will not verify peer certificate!
NOTE: Set LIBPROCESS_SSL_VERIFY_CERT=1 to enable peer certificate verification
I1108 11:46:01.166429  4300 openssl.cpp:534] LIBPROCESS_SSL_REQUIRE_CERT implies peer certificate
verification.
LIBPROCESS_SSL_VERIFY_CERT set to true
I1108 11:46:01.166429  4300 openssl.cpp:563] Using CA file: C:\Users\mesos\AppData\Local\Temp\mj1BCw\cert.pem
WARNING: Logging before InitGoogleLogging() is written to STDERR
I1108 11:46:02.427150  3584 openssl.cpp:509] CA directory path unspecified! NOTE: Set CA directory
path with LIBPROCESS_SSL_CA_DIR=<dirpath>
I1108 11:46:02.428151  3584 openssl.cpp:514] Will not verify peer certificate!
NOTE: Set LIBPROCESS_SSL_VERIFY_CERT=1 to enable peer certificate verification
I1108 11:46:02.428151  3584 openssl.cpp:526] Will use IP address verification in subject alternative
name certificate extension.
I1108 11:46:02.432162  3584 openssl.cpp:534] LIBPROCESS_SSL_REQUIRE_CERT implies peer certificate
verification.
LIBPROCESS_SSL_VERIFY_CERT set to true
I1108 11:46:02.433154  3584 openssl.cpp:563] Using CA file: C:\Users\mesos\AppData\Local\Temp\dLtZxV\cert.pem
er certificate verification
I1108 11:46:00.867468  2492 openssl.cpp:534] LIBPROCESS_SSL_REQUIRE_CERT implies peer certificate
verification.
LIBPROCESS_SSL_VERIFY_CERT set to true
I1108 11:46:00.867468  2492 openssl.cpp:563] Using CA file: C:\Users\mesos\AppData\Local\Temp\mj1BCw\cert.pem
I1108 11:46:02.125145  2492 openssl.cpp:509] CA directory path unspecified! NOTE: Set CA directory
path with LIBPROCESS_SSL_CA_DIR=<dirpath>
I1108 11:46:02.125145  2492 openssl.cpp:514] Will not verify peer certificate!
NOTE: Set LIBPROCESS_SSL_VERIFY_CERT=1 to enable peer certificate verification
I1108 11:46:02.125145  2492 openssl.cpp:526] Will use IP address verification in subject alternative
name certificate extension.
I1108 11:46:02.126145  2492 openssl.cpp:534] LIBPROCESS_SSL_REQUIRE_CERT implies peer certificate
verification.
LIBPROCESS_SSL_VERIFY_CERT set to true
I1108 11:46:02.126145  2492 openssl.cpp:563] Using CA file: C:\Users\mesos\AppData\Local\Temp\dLtZxV\cert.pem
I1108 11:46:02.641813  4008 process.cpp:1052] Failed to accept socket: future discarded
```

- Mesos Reviewbot Windows


On Nov. 8, 2017, 10:46 a.m., Armand Grillet wrote:
> 
> -----------------------------------------------------------
> This is an automatically generated e-mail. To reply, visit:
> https://reviews.apache.org/r/63661/
> -----------------------------------------------------------
> 
> (Updated Nov. 8, 2017, 10:46 a.m.)
> 
> 
> Review request for mesos and Alexander Rukletsov.
> 
> 
> Bugs: MESOS-8094
>     https://issues.apache.org/jira/browse/MESOS-8094
> 
> 
> Repository: mesos
> 
> 
> Description
> -------
> 
> Updated all the tests that send v1 API SUBSCRIBE calls to use the
> `createCallSubscribe` test helper.
> 
> 
> Diffs
> -----
> 
>   src/tests/api_tests.cpp d3e812a2a6302035634d14995939aafb216970df 
>   src/tests/mesos.hpp e25defeb55608136e77363aa48cf820092a13a59 
>   src/tests/slave_authorization_tests.cpp 11fd0d4e35523eca23a9603ecef0c9d0b65dde38 
>   src/tests/slave_recovery_tests.cpp 64bba047c6eaee563126a8bd1c6fa048f18172e1 
>   src/tests/slave_tests.cpp f9c2e6b41bdbc54ee0d8d06a2a41c92b7a1156cc 
> 
> 
> Diff: https://reviews.apache.org/r/63661/diff/1/
> 
> 
> Testing
> -------
> 
> ```
> $ make check
> ```
> 
> 
> Thanks,
> 
> Armand Grillet
> 
>


Mime
  • Unnamed multipart/alternative (inline, None, 0 bytes)
View raw message