mesos-reviews mailing list archives

Site index · List index
Message view « Date » · « Thread »
Top « Date » · « Thread »
From Mesos Reviewbot Windows <revi...@mesos.apache.org>
Subject Re: Review Request 63538: Removed expectation for scheduler connected events in some tests.
Date Tue, 07 Nov 2017 14:07:33 GMT

-----------------------------------------------------------
This is an automatically generated e-mail. To reply, visit:
https://reviews.apache.org/r/63538/#review190301
-----------------------------------------------------------



FAIL: Some Mesos libprocess-tests failed.

Reviews applied: `['63538']`

Failed command: `C:\DCOS\mesos\3rdparty\libprocess\src\tests\Debug\libprocess-tests.exe`

All the build artifacts available at: http://dcos-win.westus.cloudapp.azure.com/mesos-build/review/63538

Relevant logs:

- [libprocess-tests-stdout.log](http://dcos-win.westus.cloudapp.azure.com/mesos-build/review/63538/logs/libprocess-tests-stdout.log):

```
[       OK ] Scheme/HTTPTest.WWWAuthenticateHeader/0 (447 ms)
[ RUN      ] Scheme/HTTPTest.WWWAuthenticateHeader/1
[       OK ] Scheme/HTTPTest.WWWAuthenticateHeader/1 (66 ms)
[ RUN      ] Scheme/HTTPTest.Accepts/0
[       OK ] Scheme/HTTPTest.Accepts/0 (276 ms)
[ RUN      ] Scheme/HTTPTest.Accepts/1
[       OK ] Scheme/HTTPTest.Accepts/1 (90 ms)
[----------] 34 tests from Scheme/HTTPTest (14891 ms total)

[----------] 4 tests from SSLVerifyIPAdd/SSLTest
[ RUN      ] SSLVerifyIPAdd/SSLTest.BasicSameProcess/0
[       OK ] SSLVerifyIPAdd/SSLTest.BasicSameProcess/0 (1059 ms)
[ RUN      ] SSLVerifyIPAdd/SSLTest.BasicSameProcess/1
[       OK ] SSLVerifyIPAdd/SSLTest.BasicSameProcess/1 (356 ms)
[ RUN      ] SSLVerifyIPAdd/SSLTest.RequireCertificate/0
[       OK ] SSLVerifyIPAdd/SSLTest.RequireCertificate/0 (940 ms)
[ RUN      ] SSLVerifyIPAdd/SSLTest.RequireCertificate/1
[       OK ] SSLVerifyIPAdd/SSLTest.RequireCertificate/1 (1396 ms)
[----------] 4 tests from SSLVerifyIPAdd/SSLTest (3899 ms total)

[----------] Global test environment tear-down
[==========] 201 tests from 33 test cases ran. (49845 ms total)
[  PASSED  ] 200 tests.
[  FAILED  ] 1 test, listed below:
[  FAILED  ] SSLTest.ECDHESupport

 1 FAILED TEST
  YOU HAVE 19 DISABLED TESTS

```

- [libprocess-tests-stderr.log](http://dcos-win.westus.cloudapp.azure.com/mesos-build/review/63538/logs/libprocess-tests-stderr.log):

```
I1107 14:06:55.826413  4332 openssl.cpp:509] CA directory path unspecified! NOTE: Set CA directory
path with LIBPROCESS_SSL_CA_DIR=<dirpath>
I1107 14:06:55.829547  4332 openssl.cpp:514] Will not verify peer certificate!
NOTE: Set LIBPROCESS_SSL_VERIFY_CERT=1 to enable peWARNING: Logging before InitGoogleLogging()
is written to STDERR
I1107 14:06:56.149559  1292 openssl.cpp:509] CA directory path unspecified! NOTE: Set CA directory
path with LIBPROCESS_SSL_CA_DIR=<dirpath>
I1107 14:06:56.153584  1292 openssl.cpp:514] Will not verify peer certificate!
NOTE: Set LIBPROCESS_SSL_VERIFY_CERT=1 to enable peer certificate verification
I1107 14:06:56.154577  1292 openssl.cpp:534] LIBPROCESS_SSL_REQUIRE_CERT implies peer certificate
verification.
LIBPROCESS_SSL_VERIFY_CERT set to true
I1107 14:06:56.155557  1292 openssl.cpp:563] Using CA file: C:\Users\mesos\AppData\Local\Temp\UkTJRF\cert.pem
WARNING: Logging before InitGoogleLogging() is written to STDERR
I1107 14:06:57.503604  4236 openssl.cpp:509] CA directory path unspecified! NOTE: Set CA directory
path with LIBPROCESS_SSL_CA_DIR=<dirpath>
I1107 14:06:57.504606  4236 openssl.cpp:514] Will not verify peer certificate!
NOTE: Set LIBPROCESS_SSL_VERIFY_CERT=1 to enable peer certificate verification
I1107 14:06:57.504606  4236 openssl.cpp:526] Will use IP address verification in subject alternative
name certificate extension.
I1107 14:06:57.504606  4236 openssl.cpp:534] LIBPROCESS_SSL_REQUIRE_CERT implies peer certificate
verification.
LIBPROCESS_SSL_VERIFY_CERT set to true
I1107 14:06:57.505607  4236 openssl.cpp:563] Using CA file: C:\Users\mesos\AppData\Local\Temp\cILrcM\cert.pem
er certificate verification
I1107 14:06:55.849546  4332 openssl.cpp:534] LIBPROCESS_SSL_REQUIRE_CERT implies peer certificate
verification.
LIBPROCESS_SSL_VERIFY_CERT set to true
I1107 14:06:55.849546  4332 openssl.cpp:563] Using CA file: C:\Users\mesos\AppData\Local\Temp\UkTJRF\cert.pem
I1107 14:06:57.202595  4332 openssl.cpp:509] CA directory path unspecified! NOTE: Set CA directory
path with LIBPROCESS_SSL_CA_DIR=<dirpath>
I1107 14:06:57.202595  4332 openssl.cpp:514] Will not verify peer certificate!
NOTE: Set LIBPROCESS_SSL_VERIFY_CERT=1 to enable peer certificate verification
I1107 14:06:57.202595  4332 openssl.cpp:526] Will use IP address verification in subject alternative
name certificate extension.
I1107 14:06:57.202595  4332 openssl.cpp:534] LIBPROCESS_SSL_REQUIRE_CERT implies peer certificate
verification.
LIBPROCESS_SSL_VERIFY_CERT set to true
I1107 14:06:57.203595  4332 openssl.cpp:563] Using CA file: C:\Users\mesos\AppData\Local\Temp\cILrcM\cert.pem
I1107 14:06:57.763766  1084 process.cpp:1067] Failed to accept socket: future discarded
```

- Mesos Reviewbot Windows


On Nov. 3, 2017, 3:32 p.m., Armand Grillet wrote:
> 
> -----------------------------------------------------------
> This is an automatically generated e-mail. To reply, visit:
> https://reviews.apache.org/r/63538/
> -----------------------------------------------------------
> 
> (Updated Nov. 3, 2017, 3:32 p.m.)
> 
> 
> Review request for mesos and Alexander Rukletsov.
> 
> 
> Bugs: MESOS-8093
>     https://issues.apache.org/jira/browse/MESOS-8093
> 
> 
> Repository: mesos
> 
> 
> Description
> -------
> 
> See summary.
> 
> 
> Diffs
> -----
> 
>   src/tests/containerizer/cgroups_isolator_tests.cpp ee1e5e67b9eacb5909964b2951f659d1bd2233e5

>   src/tests/containerizer/cni_isolator_tests.cpp 0d68dd634771c016553313d67ddb33504d1a13c2

>   src/tests/containerizer/runtime_isolator_tests.cpp 81c0d825c689b3d00cbc21c7567c8c0c8836bf75

> 
> 
> Diff: https://reviews.apache.org/r/63538/diff/4/
> 
> 
> Testing
> -------
> 
> ```
> sudo ./mesos-tests.sh --gtest_filter="CgroupsIsolatorTest.ROOT_CGROUPS_LimitSwap" --gtest_break_on_failure
--gtest_repeat=100
> sudo ./mesos-tests.sh --gtest_filter="DockerRuntimeIsolatorTest.ROOT_INTERNET_CURL_NestedSimpleCommand"
--gtest_break_on_failure --gtest_repeat=100
> ```
> And `make check`.
> 
> 
> Thanks,
> 
> Armand Grillet
> 
>


Mime
  • Unnamed multipart/alternative (inline, None, 0 bytes)
View raw message