mesos-reviews mailing list archives

Site index · List index
Message view « Date » · « Thread »
Top « Date » · « Thread »
From Mesos Reviewbot Windows <revi...@mesos.apache.org>
Subject Re: Review Request 62775: Added a test `ROOT_NoTransitionFromKillingToFinished`.
Date Wed, 01 Nov 2017 13:35:03 GMT

-----------------------------------------------------------
This is an automatically generated e-mail. To reply, visit:
https://reviews.apache.org/r/62775/#review189796
-----------------------------------------------------------



FAIL: Mesos tests failed to build.

Reviews applied: `['62685', '62326', '62327', '62774', '62775']`

Failed command: `cmake.exe --build . --target mesos-tests --config Debug`

All the build artifacts available at: http://dcos-win.westus.cloudapp.azure.com/mesos-build/review/62775

Relevant logs:

- [mesos-tests-build-cmake-stdout.log](http://dcos-win.westus.cloudapp.azure.com/mesos-build/review/62775/logs/mesos-tests-build-cmake-stdout.log):

```
  C:\DCOS\mesos\mesos\src\master/master.hpp(2070): warning C4244: 'return': conversion from
'unsigned __int64' to 'double', possible loss of data (compiling source file C:\DCOS\mesos\mesos\src\tests\status_update_manager_tests.cpp)
[C:\DCOS\mesos\src\tests\mesos-tests.vcxproj]
  C:\DCOS\mesos\mesos\src\master/master.hpp(2070): warning C4244: 'return': conversion from
'unsigned __int64' to 'double', possible loss of data (compiling source file C:\DCOS\mesos\mesos\src\tests\sorter_tests.cpp)
[C:\DCOS\mesos\src\tests\mesos-tests.vcxproj]
  C:\DCOS\mesos\mesos\src\master/master.hpp(2070): warning C4244: 'return': conversion from
'unsigned __int64' to 'double', possible loss of data (compiling source file C:\DCOS\mesos\mesos\src\tests\values_tests.cpp)
[C:\DCOS\mesos\src\tests\mesos-tests.vcxproj]
  C:\DCOS\mesos\mesos\src\tests\values_tests.cpp(51): warning C4244: 'argument': conversion
from 'double' to 'float', possible loss of data [C:\DCOS\mesos\src\tests\mesos-tests.vcxproj]
  C:\DCOS\mesos\mesos\src\tests\values_tests.cpp(51): warning C4305: 'argument': truncation
from 'double' to 'float' [C:\DCOS\mesos\src\tests\mesos-tests.vcxproj]
  C:\DCOS\mesos\mesos\3rdparty\stout\include\stout/windows/os.hpp(59): warning C4996: 'GetVersionExW':
was declared deprecated (compiling source file C:\DCOS\mesos\mesos\src\tests\common\http_tests.cpp)
[C:\DCOS\mesos\src\tests\mesos-tests.vcxproj]
  C:\DCOS\mesos\mesos\3rdparty\stout\include\stout/windows/os.hpp(448): warning C4996: 'GetVersionExW':
was declared deprecated (compiling source file C:\DCOS\mesos\mesos\src\tests\common\http_tests.cpp)
[C:\DCOS\mesos\src\tests\mesos-tests.vcxproj]
  C:\DCOS\mesos\mesos\3rdparty\stout\include\stout/windows/os.hpp(59): warning C4996: 'GetVersionExW':
was declared deprecated (compiling source file C:\DCOS\mesos\mesos\src\tests\common\recordio_tests.cpp)
[C:\DCOS\mesos\src\tests\mesos-tests.vcxproj]
  C:\DCOS\mesos\mesos\3rdparty\stout\include\stout/windows/os.hpp(448): warning C4996: 'GetVersionExW':
was declared deprecated (compiling source file C:\DCOS\mesos\mesos\src\tests\common\recordio_tests.cpp)
[C:\DCOS\mesos\src\tests\mesos-tests.vcxproj]
  C:\DCOS\mesos\mesos\3rdparty\stout\include\stout/windows/os.hpp(59): warning C4996: 'GetVersionExW':
was declared deprecated (compiling source file C:\DCOS\mesos\mesos\src\tests\common\type_utils_tests.cpp)
[C:\DCOS\mesos\src\tests\mesos-tests.vcxproj]
  C:\DCOS\mesos\mesos\3rdparty\stout\include\stout/windows/os.hpp(448): warning C4996: 'GetVersionExW':
was declared deprecated (compiling source file C:\DCOS\mesos\mesos\src\tests\common\type_utils_tests.cpp)
[C:\DCOS\mesos\src\tests\mesos-tests.vcxproj]
  C:\DCOS\mesos\mesos\3rdparty\stout\include\stout/windows/os.hpp(59): warning C4996: 'GetVersionExW':
was declared deprecated (compiling source file C:\DCOS\mesos\mesos\src\tests\containerizer\containerizer_tests.cpp)
[C:\DCOS\mesos\src\tests\mesos-tests.vcxproj]
  C:\DCOS\mesos\mesos\3rdparty\stout\include\stout/windows/os.hpp(448): warning C4996: 'GetVersionExW':
was declared deprecated (compiling source file C:\DCOS\mesos\mesos\src\tests\containerizer\containerizer_tests.cpp)
[C:\DCOS\mesos\src\tests\mesos-tests.vcxproj]
  C:\DCOS\mesos\mesos\3rdparty\stout\include\stout/windows/os.hpp(59): warning C4996: 'GetVersionExW':
was declared deprecated (compiling source file C:\DCOS\mesos\mesos\src\tests\containerizer\docker_tests.cpp)
[C:\DCOS\mesos\src\tests\mesos-tests.vcxproj]
  C:\DCOS\mesos\mesos\3rdparty\stout\include\stout/windows/os.hpp(448): warning C4996: 'GetVersionExW':
was declared deprecated (compiling source file C:\DCOS\mesos\mesos\src\tests\containerizer\docker_tests.cpp)
[C:\DCOS\mesos\src\tests\mesos-tests.vcxproj]
  C:\DCOS\mesos\mesos\src\master/master.hpp(2070): warning C4244: 'return': conversion from
'unsigned __int64' to 'double', possible loss of data (compiling source file C:\DCOS\mesos\mesos\src\tests\common\type_utils_tests.cpp)
[C:\DCOS\mesos\src\tests\mesos-tests.vcxproj]
  C:\DCOS\mesos\mesos\src\master/master.hpp(2070): warning C4244: 'return': conversion from
'unsigned __int64' to 'double', possible loss of data (compiling source file C:\DCOS\mesos\mesos\src\tests\containerizer\containerizer_tests.cpp)
[C:\DCOS\mesos\src\tests\mesos-tests.vcxproj]
  C:\DCOS\mesos\mesos\src\master/master.hpp(2070): warning C4244: 'return': conversion from
'unsigned __int64' to 'double', possible loss of data (compiling source file C:\DCOS\mesos\mesos\src\tests\containerizer\docker_tests.cpp)
[C:\DCOS\mesos\src\tests\mesos-tests.vcxproj]


"C:\DCOS\mesos\src\tests\mesos-tests.vcxproj" (default target) (1) ->
(Link target) -> 
  default_executor_tests.obj : error LNK2001: unresolved external symbol "public: static char
const * const mesos::internal::tests::KillPolicyTestHelper::NAME" (?NAME@KillPolicyTestHelper@tests@internal@mesos@@2QBDB)
[C:\DCOS\mesos\src\tests\mesos-tests.vcxproj]
  C:\DCOS\mesos\src\mesos-tests.exe : fatal error LNK1120: 1 unresolved externals [C:\DCOS\mesos\src\tests\mesos-tests.vcxproj]

    454 Warning(s)
    2 Error(s)

Time Elapsed 01:10:11.53
```

- [mesos-tests-CMakeOutput.log](http://dcos-win.westus.cloudapp.azure.com/mesos-build/review/62775/logs/mesos-tests-CMakeOutput.log):

```
  Creating directory "C:\DCOS\mesos\CMakeFiles\CMakeTmp\Debug\".

  Creating directory "cmTC_92950.dir\Debug\cmTC_92950.tlog\".

InitializeBuildStatus:

  Creating "cmTC_92950.dir\Debug\cmTC_92950.tlog\unsuccessfulbuild" because "AlwaysCreate"
was specified.

ClCompile:

  C:\Program Files (x86)\Microsoft Visual Studio\2017\Community\VC\Tools\MSVC\14.10.25017\bin\HostX64\x64\CL.exe
/c /Zi /W3 /WX- /diagnostics:classic /Od /Ob0 /D WIN32 /D _WINDOWS /D COMPILER_SUPPORTS_CXX11
/D "CMAKE_INTDIR=\"Debug\"" /D _MBCS /Gm- /EHsc /RTC1 /MDd /GS /fp:precise /Zc:wchar_t /Zc:forScope
/Zc:inline /GR /Fo"cmTC_92950.dir\Debug\" /Fd"cmTC_92950.dir\Debug\vc141.pdb" /Gd /TP /errorReport:queue
C:\DCOS\mesos\CMakeFiles\CMakeTmp\src.cxx

  Microsoft (R) C/C++ Optimizing Compiler Version 19.10.25019 for x64

  Copyright (C) Microsoft Corporation.  All rights reserved.

  

  cl /c /Zi /W3 /WX- /diagnostics:classic /Od /Ob0 /D WIN32 /D _WINDOWS /D COMPILER_SUPPORTS_CXX11
/D "CMAKE_INTDIR=\"Debug\"" /D _MBCS /Gm- /EHsc /RTC1 /MDd /GS /fp:precise /Zc:wchar_t /Zc:forScope
/Zc:inline /GR /Fo"cmTC_92950.dir\Debug\" /Fd"cmTC_92950.dir\Debug\vc141.pdb" /Gd /TP /errorReport:queue
C:\DCOS\mesos\CMakeFiles\CMakeTmp\src.cxx

  src.cxx

  

Link:

  C:\Program Files (x86)\Microsoft Visual Studio\2017\Community\VC\Tools\MSVC\14.10.25017\bin\HostX64\x64\link.exe
/ERRORREPORT:QUEUE /OUT:"C:\DCOS\mesos\CMakeFiles\CMakeTmp\Debug\cmTC_92950.exe" /INCREMENTAL
/NOLOGO kernel32.lib user32.lib gdi32.lib winspool.lib shell32.lib ole32.lib oleaut32.lib
uuid.lib comdlg32.lib advapi32.lib /MANIFEST /MANIFESTUAC:"level='asInvoker' uiAccess='false'"
/manifest:embed /DEBUG /PDB:"C:/DCOS/mesos/CMakeFiles/CMakeTmp/Debug/cmTC_92950.pdb" /SUBSYSTEM:CONSOLE
/TLBID:1 /DYNAMICBASE /NXCOMPAT /IMPLIB:"C:/DCOS/mesos/CMakeFiles/CMakeTmp/Debug/cmTC_92950.lib"
/MACHINE:X64  /machine:x64 cmTC_92950.dir\Debug\src.obj

  cmTC_92950.vcxproj -> C:\DCOS\mesos\CMakeFiles\CMakeTmp\Debug\cmTC_92950.exe

  cmTC_92950.vcxproj -> C:/DCOS/mesos/CMakeFiles/CMakeTmp/Debug/cmTC_92950.pdb (Full PDB)

FinalizeBuildStatus:

  Deleting file "cmTC_92950.dir\Debug\cmTC_92950.tlog\unsuccessfulbuild".

  Touching "cmTC_92950.dir\Debug\cmTC_92950.tlog\cmTC_92950.lastbuildstate".

Done Building Project "C:\DCOS\mesos\CMakeFiles\CMakeTmp\cmTC_92950.vcxproj" (default targets).



Build succeeded.

    0 Warning(s)

    0 Error(s)



Time Elapsed 00:00:01.72


Source file was:
int main() { return 0; }
```

- [mesos-tests-CMakeError.log](http://dcos-win.westus.cloudapp.azure.com/mesos-build/review/62775/logs/mesos-tests-CMakeError.log):

```
PrepareForBuild:

  Creating directory "cmTC_9a414.dir\Debug\".

  Creating directory "C:\DCOS\mesos\CMakeFiles\CMakeTmp\Debug\".

  Creating directory "cmTC_9a414.dir\Debug\cmTC_9a414.tlog\".

InitializeBuildStatus:

  Creating "cmTC_9a414.dir\Debug\cmTC_9a414.tlog\unsuccessfulbuild" because "AlwaysCreate"
was specified.

ClCompile:

  C:\Program Files (x86)\Microsoft Visual Studio\2017\Community\VC\Tools\MSVC\14.10.25017\bin\HostX64\x64\CL.exe
/c /Zi /W3 /WX- /diagnostics:classic /MP /Od /Ob0 /D WIN32 /D _WINDOWS /D UNICODE /D _UNICODE
/D "CMAKE_INTDIR=\"Debug\"" /D _UNICODE /D UNICODE /Gm- /RTC1 /MTd /GS /fp:precise /Zc:wchar_t
/Zc:forScope /Zc:inline /Fo"cmTC_9a414.dir\Debug\" /Fd"cmTC_9a414.dir\Debug\vc141.pdb" /Gd
/TC /errorReport:queue C:\DCOS\mesos\CMakeFiles\CMakeTmp\CheckIncludeFile.c

  Microsoft (R) C/C++ Optimizing Compiler Version 19.10.25019 for x64

  Copyright (C) Microsoft Corporation.  All rights reserved.

  

  cl /c /Zi /W3 /WX- /diagnostics:classic /MP /Od /Ob0 /D WIN32 /D _WINDOWS /D UNICODE /D
_UNICODE /D "CMAKE_INTDIR=\"Debug\"" /D _UNICODE /D UNICODE /Gm- /RTC1 /MTd /GS /fp:precise
/Zc:wchar_t /Zc:forScope /Zc:inline /Fo"cmTC_9a414.dir\Debug\" /Fd"cmTC_9a414.dir\Debug\vc141.pdb"
/Gd /TC /errorReport:queue C:\DCOS\mesos\CMakeFiles\CMakeTmp\CheckIncludeFile.c

  CheckIncludeFile.c

  

C:\DCOS\mesos\CMakeFiles\CMakeTmp\CheckIncludeFile.c(1): fatal error C1083: Cannot open include
file: 'pthread.h': No such file or directory [C:\DCOS\mesos\CMakeFiles\CMakeTmp\cmTC_9a414.vcxproj]

Done Building Project "C:\DCOS\mesos\CMakeFiles\CMakeTmp\cmTC_9a414.vcxproj" (default targets)
-- FAILED.



Build FAILED.



"C:\DCOS\mesos\CMakeFiles\CMakeTmp\cmTC_9a414.vcxproj" (default target) (1) ->

(ClCompile target) -> 

  C:\DCOS\mesos\CMakeFiles\CMakeTmp\CheckIncludeFile.c(1): fatal error C1083: Cannot open
include file: 'pthread.h': No such file or directory [C:\DCOS\mesos\CMakeFiles\CMakeTmp\cmTC_9a414.vcxproj]



    0 Warning(s)

    1 Error(s)



Time Elapsed 00:00:01.13



```

- Mesos Reviewbot Windows


On Nov. 1, 2017, 11:45 a.m., Qian Zhang wrote:
> 
> -----------------------------------------------------------
> This is an automatically generated e-mail. To reply, visit:
> https://reviews.apache.org/r/62775/
> -----------------------------------------------------------
> 
> (Updated Nov. 1, 2017, 11:45 a.m.)
> 
> 
> Review request for mesos, Anand Mazumdar and Vinod Kone.
> 
> 
> Bugs: MESOS-7975
>     https://issues.apache.org/jira/browse/MESOS-7975
> 
> 
> Repository: mesos
> 
> 
> Description
> -------
> 
> Added a test `ROOT_NoTransitionFromKillingToFinished`.
> 
> 
> Diffs
> -----
> 
>   src/tests/default_executor_tests.cpp f485b613084331c18781c2f0070d049061179050 
>   src/tests/kill_policy_test_helper.cpp a1880595ff015475f1ba49437d49f7397da19422 
> 
> 
> Diff: https://reviews.apache.org/r/62775/diff/3/
> 
> 
> Testing
> -------
> 
> [ RUN      ] MesosContainerizer/DefaultExecutorTest.KillMultipleTasks/0
> I1101 19:07:49.244680 24316 executor.cpp:192] Version: 1.5.0
> I1101 19:07:49.277947 24336 default_executor.cpp:191] Received SUBSCRIBED event
> I1101 19:07:49.281920 24336 default_executor.cpp:195] Subscribed executor on workstation
> I1101 19:07:49.282701 24336 default_executor.cpp:191] Received LAUNCH_GROUP event
> I1101 19:07:49.286540 24330 default_executor.cpp:402] Setting 'MESOS_CONTAINER_IP' to:
10.0.2.5
> I1101 19:07:49.313779 24336 default_executor.cpp:191] Received ACKNOWLEDGED event
> I1101 19:07:49.342092 24331 default_executor.cpp:191] Received ACKNOWLEDGED event
> I1101 19:07:49.374323 24334 default_executor.cpp:640] Successfully launched tasks [ aebaff2e-92fd-47e6-8423-48ceeb21f231,
e7db282a-dc45-4a52-a48d-58e58c27f556 ] in child containers [ dcceb657-8f81-4486-8a08-e7fa9651fdac.cb2c9a1a-d8ce-440b-a5d5-311ac527f675,
dcceb657-8f81-4486-8a08-e7fa9651fdac.a3b934a2-5cb6-4612-a369-2fa26897e9b6 ]
> I1101 19:07:49.386710 24337 default_executor.cpp:713] Waiting for child container dcceb657-8f81-4486-8a08-e7fa9651fdac.cb2c9a1a-d8ce-440b-a5d5-311ac527f675
of task 'aebaff2e-92fd-47e6-8423-48ceeb21f231'
> I1101 19:07:49.387315 24337 default_executor.cpp:713] Waiting for child container dcceb657-8f81-4486-8a08-e7fa9651fdac.a3b934a2-5cb6-4612-a369-2fa26897e9b6
of task 'e7db282a-dc45-4a52-a48d-58e58c27f556'
> I1101 19:07:49.446444 24331 default_executor.cpp:191] Received ACKNOWLEDGED event
> I1101 19:07:49.458606 24335 default_executor.cpp:191] Received ACKNOWLEDGED event
> I1101 19:07:49.499390 24332 default_executor.cpp:191] Received KILL event
> I1101 19:07:49.499712 24332 default_executor.cpp:1172] Received kill for task 'aebaff2e-92fd-47e6-8423-48ceeb21f231'
> I1101 19:07:49.500016 24332 default_executor.cpp:1057] Killing task aebaff2e-92fd-47e6-8423-48ceeb21f231
running in child container dcceb657-8f81-4486-8a08-e7fa9651fdac.cb2c9a1a-d8ce-440b-a5d5-311ac527f675
with SIGTERM signal
> I1101 19:07:49.500139 24332 default_executor.cpp:1079] Scheduling escalation to SIGKILL
in 3secs from now
> I1101 19:07:49.501317 24332 default_executor.cpp:191] Received KILL event
> I1101 19:07:49.501617 24332 default_executor.cpp:1172] Received kill for task 'e7db282a-dc45-4a52-a48d-58e58c27f556'
> I1101 19:07:49.501972 24332 default_executor.cpp:1057] Killing task e7db282a-dc45-4a52-a48d-58e58c27f556
running in child container dcceb657-8f81-4486-8a08-e7fa9651fdac.a3b934a2-5cb6-4612-a369-2fa26897e9b6
with SIGTERM signal
> I1101 19:07:49.502081 24332 default_executor.cpp:1079] Scheduling escalation to SIGKILL
in 3secs from now
> I1101 19:07:49.577337 24332 default_executor.cpp:888] Child container dcceb657-8f81-4486-8a08-e7fa9651fdac.cb2c9a1a-d8ce-440b-a5d5-311ac527f675
of task 'aebaff2e-92fd-47e6-8423-48ceeb21f231' completed in state TASK_KILLED: Command terminated
with signal Killed
> I1101 19:07:49.577422 24332 default_executor.cpp:924] Killing task group containing tasks
[ aebaff2e-92fd-47e6-8423-48ceeb21f231, e7db282a-dc45-4a52-a48d-58e58c27f556 ]
> I1101 19:07:49.588505 24332 default_executor.cpp:888] Child container dcceb657-8f81-4486-8a08-e7fa9651fdac.a3b934a2-5cb6-4612-a369-2fa26897e9b6
of task 'e7db282a-dc45-4a52-a48d-58e58c27f556' completed in state TASK_KILLED: Command terminated
with signal Killed
> I1101 19:07:49.588593 24332 default_executor.cpp:1017] Terminating after 1secs
> [       OK ] MesosContainerizer/DefaultExecutorTest.KillMultipleTasks/0 (1013 ms)
> 
> 
> [ RUN      ] ROOT_DOCKER_DockerAndMesosContainerizers/DefaultExecutorTest.KillMultipleTasks/0
> I1101 19:44:45.021219 24574 executor.cpp:192] Version: 1.5.0
> I1101 19:44:45.062325 24591 default_executor.cpp:191] Received SUBSCRIBED event
> I1101 19:44:45.066876 24591 default_executor.cpp:195] Subscribed executor on workstation
> I1101 19:44:45.067586 24591 default_executor.cpp:191] Received LAUNCH_GROUP event
> I1101 19:44:45.070425 24590 default_executor.cpp:402] Setting 'MESOS_CONTAINER_IP' to:
10.0.2.5
> I1101 19:44:45.101138 24588 default_executor.cpp:191] Received ACKNOWLEDGED event
> I1101 19:44:45.120609 24588 default_executor.cpp:191] Received ACKNOWLEDGED event
> I1101 19:44:45.200438 24592 default_executor.cpp:640] Successfully launched tasks [ bd4ea3aa-e920-4f5b-8fc1-11986c006e8f,
187e2bdc-38a4-4e3d-bb74-33fb816e31c4 ] in child containers [ decae4b4-dd75-4c12-8d8f-cfee34c3bf70.c1190d4b-8ebd-42e8-bc04-2c295318d092,
decae4b4-dd75-4c12-8d8f-cfee34c3bf70.bb89dcf8-c30d-4fe1-a42b-91e1e0ff221b ]
> I1101 19:44:45.252046 24592 default_executor.cpp:713] Waiting for child container decae4b4-dd75-4c12-8d8f-cfee34c3bf70.c1190d4b-8ebd-42e8-bc04-2c295318d092
of task 'bd4ea3aa-e920-4f5b-8fc1-11986c006e8f'
> I1101 19:44:45.255779 24592 default_executor.cpp:713] Waiting for child container decae4b4-dd75-4c12-8d8f-cfee34c3bf70.bb89dcf8-c30d-4fe1-a42b-91e1e0ff221b
of task '187e2bdc-38a4-4e3d-bb74-33fb816e31c4'
> I1101 19:44:45.289633 24588 default_executor.cpp:191] Received ACKNOWLEDGED event
> I1101 19:44:45.295717 24588 default_executor.cpp:191] Received ACKNOWLEDGED event
> I1101 19:44:45.355026 24589 default_executor.cpp:191] Received KILL event
> I1101 19:44:45.355679 24589 default_executor.cpp:1172] Received kill for task 'bd4ea3aa-e920-4f5b-8fc1-11986c006e8f'
> I1101 19:44:45.355995 24589 default_executor.cpp:1057] Killing task bd4ea3aa-e920-4f5b-8fc1-11986c006e8f
running in child container decae4b4-dd75-4c12-8d8f-cfee34c3bf70.c1190d4b-8ebd-42e8-bc04-2c295318d092
with SIGTERM signal
> I1101 19:44:45.356132 24589 default_executor.cpp:1079] Scheduling escalation to SIGKILL
in 3secs from now
> I1101 19:44:45.357436 24589 default_executor.cpp:191] Received KILL event
> I1101 19:44:45.357635 24589 default_executor.cpp:1172] Received kill for task '187e2bdc-38a4-4e3d-bb74-33fb816e31c4'
> I1101 19:44:45.357844 24589 default_executor.cpp:1057] Killing task 187e2bdc-38a4-4e3d-bb74-33fb816e31c4
running in child container decae4b4-dd75-4c12-8d8f-cfee34c3bf70.bb89dcf8-c30d-4fe1-a42b-91e1e0ff221b
with SIGTERM signal
> I1101 19:44:45.358074 24589 default_executor.cpp:1079] Scheduling escalation to SIGKILL
in 3secs from now
> I1101 19:44:45.519832 24592 default_executor.cpp:888] Child container decae4b4-dd75-4c12-8d8f-cfee34c3bf70.bb89dcf8-c30d-4fe1-a42b-91e1e0ff221b
of task '187e2bdc-38a4-4e3d-bb74-33fb816e31c4' completed in state TASK_KILLED: Command terminated
with signal Killed
> I1101 19:44:45.520102 24592 default_executor.cpp:924] Killing task group containing tasks
[ bd4ea3aa-e920-4f5b-8fc1-11986c006e8f, 187e2bdc-38a4-4e3d-bb74-33fb816e31c4 ]
> I1101 19:44:45.521134 24592 default_executor.cpp:888] Child container decae4b4-dd75-4c12-8d8f-cfee34c3bf70.c1190d4b-8ebd-42e8-bc04-2c295318d092
of task 'bd4ea3aa-e920-4f5b-8fc1-11986c006e8f' completed in state TASK_KILLED: Command terminated
with signal Terminated
> I1101 19:44:45.521200 24592 default_executor.cpp:1017] Terminating after 1secs
> [       OK ] ROOT_DOCKER_DockerAndMesosContainerizers/DefaultExecutorTest.KillMultipleTasks/0
(1417 ms)
> 
> 
> Thanks,
> 
> Qian Zhang
> 
>


Mime
  • Unnamed multipart/alternative (inline, None, 0 bytes)
View raw message