mesos-reviews mailing list archives

Site index · List index
Message view « Date » · « Thread »
Top « Date » · « Thread »
From Mesos Reviewbot Windows <revi...@mesos.apache.org>
Subject Re: Review Request 63001: Updated protobuf definitions related to offer operations.
Date Tue, 17 Oct 2017 06:59:14 GMT

-----------------------------------------------------------
This is an automatically generated e-mail. To reply, visit:
https://reviews.apache.org/r/63001/#review188280
-----------------------------------------------------------



FAIL: Some Mesos tests failed.

Reviews applied: `['62974', '63001']`

Failed command: `C:\mesos\src\mesos-tests.exe --verbose --gtest_filter="-ContentType/MasterAPITest.EventAuthorizationFiltering/1"`

All the build artifacts available at: http://dcos-win.westus.cloudapp.azure.com/mesos-build/review/63001

Relevant logs:

- [mesos-tests-stdout.log](http://dcos-win.westus.cloudapp.azure.com/mesos-build/review/63001/logs/mesos-tests-stdout.log):

```
[       OK ] Endpoint/SlaveEndpointTest.UnauthorizedRequest/0 (309 ms)
[ RUN      ] Endpoint/SlaveEndpointTest.UnauthorizedRequest/1
[       OK ] Endpoint/SlaveEndpointTest.UnauthorizedRequest/1 (264 ms)
[ RUN      ] Endpoint/SlaveEndpointTest.UnauthorizedRequest/2
[       OK ] Endpoint/SlaveEndpointTest.UnauthorizedRequest/2 (291 ms)
[ RUN      ] Endpoint/SlaveEndpointTest.NoAuthorizer/0
[       OK ] Endpoint/SlaveEndpointTest.NoAuthorizer/0 (285 ms)
[ RUN      ] Endpoint/SlaveEndpointTest.NoAuthorizer/1
[       OK ] Endpoint/SlaveEndpointTest.NoAuthorizer/1 (305 ms)
[ RUN      ] Endpoint/SlaveEndpointTest.NoAuthorizer/2
[       OK ] Endpoint/SlaveEndpointTest.NoAuthorizer/2 (305 ms)
[----------] 9 tests from Endpoint/SlaveEndpointTest (3111 ms total)

[----------] 2 tests from ContainerizerType/DefaultContainerDNSFlagTest
[ RUN      ] ContainerizerType/DefaultContainerDNSFlagTest.ValidateFlag/0
[       OK ] ContainerizerType/DefaultContainerDNSFlagTest.ValidateFlag/0 (139 ms)
[ RUN      ] ContainerizerType/DefaultContainerDNSFlagTest.ValidateFlag/1
[       OK ] ContainerizerType/DefaultContainerDNSFlagTest.ValidateFlag/1 (144 ms)
[----------] 2 tests from ContainerizerType/DefaultContainerDNSFlagTest (358 ms total)

[----------] Global test environment tear-down
[==========] 723 tests from 73 test cases ran. (369739 ms total)
[  PASSED  ] 722 tests.
[  FAILED  ] 1 test, listed below:
[  FAILED  ] ResourceProviderCallValidationTest.Update

 1 FAILED TEST
  YOU HAVE 166 DISABLED TESTS

```

- [mesos-tests-stderr.log](http://dcos-win.westus.cloudapp.azure.com/mesos-build/review/63001/logs/mesos-tests-stderr.log):

```
I1017 06:58:32.541306 62212 containerizer.cpp:649] Recovering containerizer
I1017 06:58:32.548305 57708 provisioner.cpp:416] Provisioner recovery complete
I1017 06:58:32.549304 58452 slave.cpp:6322] Finished recovery
I1017 06:58:32.574306 62212 http.cpp:1185] HTTP GET for /slave(270)/monitor/statistics.json
from 10.3.1.7:65068
I1017 06:58:32.575306 62212 http.cpp:976] Authorizing principal 'test-principal' to GET the
'/monitor/statistics.json' endpoint
I1017 06:58:32.598309 61284 slave.cpp:869] Agent terminating
I1017 06:58:32.822024 63224 containerizer.cpp:292] Using isolation { windows/cpu, filesystem/windows,
environment_secret }
I1017 06:58:32.825024 63224 provisioner.cpp:255] Using default backend 'copy'
I1017 06:58:32.842025 63224 cluster.cpp:448] Creating default 'local' authorizer
I1017 06:58:32.861024 61284 slave.cpp:254] Mesos agent started on (271)@10.3.1.7:64131
I1017 06:58:32.862025 61284 slave.cpp:255] Flags at startup: --acls="" --appc_simple_discovery_uri_prefix="http://"
--appc_store_dir="C:\Users\mesos\AppData\Local\Temp\2\VmAS6A\store\appc" --authenticate_http_readonly="true"
--authenticate_http_readwrite="true" --authenticatee="crammd5" --authentication_backoff_factor="1secs"
--authorizer="local" --container_disk_watch_interval="15secs" --containerizers="mesos" --credential="C:\Users\mesos\AppData\Local\Temp\2\VmAS6A\credential"
--default_role="*" --disk_watch_interval="1mins" --docker="docker" --docker_kill_orphans="true"
--docker_registry="https://registry-1.docker.io" --docker_remove_delay="6hrs" --docker_socket="//./pipe/docker_engine"
--docker_stop_timeout="0ns" --docker_store_dir="C:\Users\mesos\AppData\Local\Temp\2\VmAS6A\store\docker"
--docker_volume_checkpoint_dir="/var/run/mesos/isolators/docker/volume" --enforce_container_disk_quota="false"
--executor_registration_timeout="1mins" --executor_reregistration_timeout="2secs" -
 -executor_shutdown_grace_period="5secs" --fetcher_cache_dir="C:\Users\mesos\AppData\Local\Temp\2\VmAS6A\fetch"
--fetcher_cache_size="2GB" --frameworks_home="" --gc_delay="1weeks" --gc_disk_headroom="0.1"
--hadoop_home="" --help="false" --hostname_lookup="true" --http_command_executor="false" --http_credentials="C:\Users\mesos\AppData\Local\Temp\2\VmAS6A\http_credentials"
--http_heartbeat_interval="30secs" --initialize_driver_logging="true" --isolation="windows/cpu"
--launcher="windows" --launcher_dir="C:\mesos\src" --logbufsecs="0" --logging_level="INFO"
--max_completed_executors_per_framework="150" --oversubscribed_resources_interval="15secs"
--port="5051" --qos_correction_interval_min="0ns" --quiet="false" --recover="reconnect" --recovery_timeout="15mins"
--registration_backoff_factor="10ms" --resources="cpus:2;gpus:0;mem:1024;disk:1024;ports:[31000-32000]"
--runtime_dir="C:\Users\mesos\AppData\Local\Temp\2\VmAS6A" --sandbox_directory="C:\mesos\sandbox"
--strict="true" --version="
 false" --work_dir="C:\Users\mesos\AppData\Local\Temp\2\EAuOhF" --zk_session_timeout="10secs"
I1017 06:58:32.888038 61284 credentials.hpp:86] Loading credential for authentication from
'C:\Users\mesos\AppData\Local\Temp\2\VmAS6A\credential'
I1017 06:58:32.889029 61284 slave.cpp:287] Agent using credential for: test-principal
I1017 06:58:32.890029 61284 credentials.hpp:37] Loading credentials for authentication from
'C:\Users\mesos\AppData\Local\Temp\2\VmAS6A\http_credentials'
I1017 06:58:32.892030 61284 http.cpp:1045] Creating default 'basic' HTTP authenticator for
realm 'mesos-agent-readonly'
I1017 06:58:32.893029 61284 http.cpp:1045] Creating default 'basic' HTTP authenticator for
realm 'mesos-agent-readwrite'
I1017 06:58:32.929026 61284 slave.cpp:585] Agent resources: [{"name":"cpus","scalar":{"value":2.0},"type":"SCALAR"},{"name":"mem","scalar":{"value":1024.0},"type":"SCALAR"},{"name":"disk","scalar":{"value":1024.0},"type":"SCALAR"},{"name":"ports","ranges":{"range":[{"begin":31000,"end":32000}]},"type":"RANGES"}]
I1017 06:58:32.932026 61284 slave.cpp:593] Agent attributes: [  ]
I1017 06:58:32.933027 61284 slave.cpp:602] Agent hostname: mesos-bld-s2.zq4gs31qjdiunm1ryi1452nvnh.dx.internal.cloudapp.net
I1017 06:58:32.933027 57708 status_update_manager.cpp:177] Pausing sending status updates
I1017 06:58:32.944025 58936 state.cpp:64] Recovering state from 'C:\Users\mesos\AppData\Local\Temp\2\EAuOhF\meta'
I1017 06:58:32.945026 57708 status_update_manager.cpp:203] Recovering status update manager
I1017 06:58:32.946027 62212 containerizer.cpp:649] Recovering containerizer
I1017 06:58:32.952028 61284 provisioner.cpp:416] Provisioner recovery complete
I1017 06:58:32.952028 62176 slave.cpp:6322] Finished recovery
I1017 06:58:32.988028 62176 http.cpp:1185] HTTP GET for /slave(271)/containers from 10.3.1.7:65069
I1017 06:58:32.989028 62176 http.cpp:976] Authorizing principal 'test-principal' to GET the
'/containers' endpoint
I1017 06:58:33.008028 62176 slave.cpp:869] Agent terminating
I1017 06:58:34.312995 61716 process.cpp:1068] Failed to accept socket: future discarded
```

- Mesos Reviewbot Windows


On Oct. 17, 2017, 1:08 p.m., Jie Yu wrote:
> 
> -----------------------------------------------------------
> This is an automatically generated e-mail. To reply, visit:
> https://reviews.apache.org/r/63001/
> -----------------------------------------------------------
> 
> (Updated Oct. 17, 2017, 1:08 p.m.)
> 
> 
> Review request for mesos, Benjamin Bannier, Benjamin Mahler, Gaston Kleiman, Greg Mann,
Jan Schlicht, and Vinod Kone.
> 
> 
> Repository: mesos
> 
> 
> Description
> -------
> 
> Updated protobuf definitions related to offer operations.
> 
> 
> Diffs
> -----
> 
>   include/mesos/mesos.proto ba87339dbe341f4d16ceea74adc09647a3c07f32 
>   include/mesos/resource_provider/resource_provider.proto f5a9073075327019fd133bd51265f695ef464845

>   include/mesos/v1/mesos.proto a6d662fb26aa4f78ef20ffe6e013f7a45f7f8c21 
>   include/mesos/v1/resource_provider/resource_provider.proto e5cbede5b6e57a8641fca1ebfee5454f292cc24c

>   src/messages/messages.proto 0a32b3457e9143a7d48670610ca3e56dd516136f 
>   src/resource_provider/manager.cpp 31fcb789f5ab907511e868c374c49f7457a33ed3 
>   src/resource_provider/validation.cpp d2927227f60ab0d4ae2481ad73a31ee444b48ee0 
>   src/tests/resource_provider_validation_tests.cpp f182bff4670318e9de22c2915c5dbb423a74ad6c

> 
> 
> Diff: https://reviews.apache.org/r/63001/diff/4/
> 
> 
> Testing
> -------
> 
> make check
> 
> 
> Thanks,
> 
> Jie Yu
> 
>


Mime
  • Unnamed multipart/alternative (inline, None, 0 bytes)
View raw message