mesos-reviews mailing list archives

Site index · List index
Message view « Date » · « Thread »
Top « Date » · « Thread »
From Mesos Reviewbot Windows <revi...@mesos.apache.org>
Subject Re: Review Request 62213: Fix unit tests that were broken by the additional TASK_STARTING update.
Date Mon, 02 Oct 2017 19:00:04 GMT

-----------------------------------------------------------
This is an automatically generated e-mail. To reply, visit:
https://reviews.apache.org/r/62213/#review186868
-----------------------------------------------------------



FAIL: Some Mesos tests failed.

Reviews applied: `['62212', '62213']`

Failed command: `C:\mesos\src\mesos-tests.exe --verbose --gtest_filter="-ContentType/MasterAPITest.EventAuthorizationFiltering/1"`

All the build artifacts available at: http://dcos-win.westus.cloudapp.azure.com/mesos-build/review/62213

Relevant logs:

- [mesos-tests-stdout.log](http://dcos-win.westus.cloudapp.azure.com/mesos-build/review/62213/logs/mesos-tests-stdout.log):

```
[       OK ] ContentType/SchedulerTest.SchedulerReconnect/0 (270 ms)
[ RUN      ] ContentType/SchedulerTest.SchedulerReconnect/1
[       OK ] ContentType/SchedulerTest.SchedulerReconnect/1 (271 ms)
[----------] 30 tests from ContentType/SchedulerTest (25886 ms total)

[----------] 2 tests from ContentTypeAndSSLConfig/SchedulerSSLTest
[ RUN      ] ContentTypeAndSSLConfig/SchedulerSSLTest.RunTaskAndTeardown/0
[       OK ] ContentTypeAndSSLConfig/SchedulerSSLTest.RunTaskAndTeardown/0 (961 ms)
[ RUN      ] ContentTypeAndSSLConfig/SchedulerSSLTest.RunTaskAndTeardown/1
[       OK ] ContentTypeAndSSLConfig/SchedulerSSLTest.RunTaskAndTeardown/1 (1048 ms)
[----------] 2 tests from ContentTypeAndSSLConfig/SchedulerSSLTest (2104 ms total)

[----------] 2 tests from ContainerizerType/DefaultContainerDNSFlagTest
[ RUN      ] ContainerizerType/DefaultContainerDNSFlagTest.ValidateFlag/0
[       OK ] ContainerizerType/DefaultContainerDNSFlagTest.ValidateFlag/0 (150 ms)
[ RUN      ] ContainerizerType/DefaultContainerDNSFlagTest.ValidateFlag/1
[       OK ] ContainerizerType/DefaultContainerDNSFlagTest.ValidateFlag/1 (149 ms)
[----------] 2 tests from ContainerizerType/DefaultContainerDNSFlagTest (338 ms total)

[----------] Global test environment tear-down
[==========] 634 tests from 67 test cases ran. (333837 ms total)
[  PASSED  ] 632 tests.
[  FAILED  ] 2 tests, listed below:
[  FAILED  ] MesosContainerizer/DefaultExecutorTest.ROOT_ContainerStatusForTask/0, where GetParam()
= "mesos"
[  FAILED  ] MesosContainerizer/DefaultExecutorTest.TaskWithFileURI/0, where GetParam() =
"mesos"

 2 FAILED TESTS
  YOU HAVE 182 DISABLED TESTS

```

- [mesos-tests-stderr.log](http://dcos-win.westus.cloudapp.azure.com/mesos-build/review/62213/logs/mesos-tests-stderr.log):

```
I1002 18:59:23.112658 39736 master.cpp:8438] Removing framework 39ecafac-8c8f-4d59-974f-ac892e112d1c-0000
(default)
I1002 18:59:23.113657 39736 master.cpp:3317] Deactivating framework 39ecafac-8c8f-4d59-974f-ac892e112d1c-0000
(default)
I1002 18:59:23.117661 39148 hierarchical.cpp:412] Deactivated framework 39ecafac-8c8f-4d59-974f-ac892e112d1c-0000
I1002 18:59:23.117661 37024 slave.cpp:3239] Shutting down framework 39ecafac-8c8f-4d59-974f-ac892e112d1c-0000
I1002 18:59:23.117661 39736 master.cpp:9136] Updating the state of task d0b7c9c4-54f5-45c3-be1c-a3eee8fb1a02
of framework 39ecafac-8c8f-4d59-974f-ac892e112d1c-0000 (latest state: TASK_KILLED, status
update state: TASK_KILLED)
I1002 18:59:23.118656 37024 slave.cpp:5746] Shutting down executor 'default' of framework
39ecafac-8c8f-4d59-974f-ac892e112d1c-0000 (via HTTP)
I1002 18:59:23.130655 39736 master.cpp:9230] Removing task d0b7c9c4-54f5-45c3-be1c-a3eee8fb1a02
with resources [{"allocation_info":{"role":"*"},"name":"cpus","scalar":{"value":2.0},"type":"SCALAR"},{"allocation_info":{"role":"*"},"name":"mem","scalar":{"value":1024.0},"type":"SCALAR"},{"allocation_info":{"role":"*"},"name":"disk","scalar":{"value":1024.0},"type":"SCALAR"},{"allocation_info":{"role":"*"},"name":"ports","ranges":{"range":[{"begin":31000,"end":32000}]},"type":"RANGES"}]
of framework 39ecafac-8c8f-4d59-974f-ac892e112d1c-0000 on agent 39ecafac-8c8f-4d59-974f-ac892e112d1c-S0
at slave(251)@10.3.1.5:59141 (mesos-bld-s1.zq4gs31qjdiunm1ryi1452nvnh.dx.internal.cloudapp.net)
I1002 18:59:23.149662 39736 master.cpp:9259] Removing executor 'default' with resources []
of framework 39ecafac-8c8f-4d59-974f-ac892e112d1c-0000 on agent 39ecafac-8c8f-4d59-974f-ac892e112d1c-S0
at slave(251)@10.3.1.5:59141 (mesos-bld-s1.zq4gs31qjdiunm1ryi1452nvnh.dx.internal.cloudapp.net)
I1002 18:59:23.153650 39148 hierarchical.cpp:355] Removed framework 39ecafac-8c8f-4d59-974f-ac892e112d1c-0000
E1002 18:59:23.154649 38724 scheduler.cpp:649] End-Of-File received from master. The master
closed the event stream
I1002 18:59:23.154649 39148 scheduler.cpp:444] Re-detecting master
I1002 18:59:23.158648 39148 scheduler.cpp:470] New master detected at master@10.3.1.5:59141
I1002 18:59:23.171648 34868 slave.cpp:5411] Executor 'default' of framework 39ecafac-8c8f-4d59-974f-ac892e112d1c-0000
exited with status 0
I1002 18:59:23.172665 34868 slave.cpp:5515] Cleaning up executor 'default' of framework 39ecafac-8c8f-4d59-974f-ac892e112d1c-0000
(via HTTP)
W1002 18:59:23.172665 39736 master.cpp:7089] Ignoring unknown exited executor 'default' of
framework 39ecafac-8c8f-4d59-974f-ac892e112d1c-0000 on agent 39ecafac-8c8f-4d59-974f-ac892e112d1c-S0
at slave(251)@10.3.1.5:59141 (mesos-bld-s1.zq4gs31qjdiunm1ryi1452nvnh.dx.internal.cloudapp.net)
I1002 18:59:23.176646 37024 gc.cpp:90] Scheduling 'C:\Users\mesos\AppData\Local\Temp\2\9YiKpX\slaves\39ecafac-8c8f-4d59-974f-ac892e112d1c-S0\frameworks\39ecafac-8c8f-4d59-974f-ac892e112d1c-0000\executors\default\runs\7e5396c4-657f-4520-a9a6-c625c77dbd31'
for gc 6.99998638140148days in the future
I1002 18:59:23.179647 34868 slave.cpp:5622] Cleaning up framework 39ecafac-8c8f-4d59-974f-ac892e112d1c-0000
I1002 18:59:23.185649 39148 status_update_manager.cpp:285] Closing status update streams for
framework 39ecafac-8c8f-4d59-974f-ac892e112d1c-0000
I1002 18:59:23.185649 37024 gc.cpp:90] Scheduling 'C:\Users\mesos\AppData\Local\Temp\2\9YiKpX\slaves\39ecafac-8c8f-4d59-974f-ac892e112d1c-S0\frameworks\39ecafac-8c8f-4d59-974f-ac892e112d1c-0000\executors\default'
for gc 6.99998635825185days in the future
I1002 18:59:23.186645 34868 slave.cpp:869] Agent terminating
I1002 18:59:23.196647 37024 gc.cpp:90] Scheduling 'C:\Users\mesos\AppData\Local\Temp\2\9YiKpX\slaves\39ecafac-8c8f-4d59-974f-ac892e112d1c-S0\frameworks\39ecafac-8c8f-4d59-974f-ac892e112d1c-0000'
for gc 6.99998626567111days in the future
I1002 18:59:23.197643 35140 master.cpp:1321] Agent 39ecafac-8c8f-4d59-974f-ac892e112d1c-S0
at slave(251)@10.3.1.5:59141 (mesos-bld-s1.zq4gs31qjdiunm1ryi1452nvnh.dx.internal.cloudapp.net)
disconnected
I1002 18:59:23.197643 35140 master.cpp:3354] Disconnecting agent 39ecafac-8c8f-4d59-974f-ac892e112d1c-S0
at slave(251)@10.3.1.5:59141 (mesos-bld-s1.zq4gs31qjdiunm1ryi1452nvnh.dx.internal.cloudapp.net)
I1002 18:59:23.197643 35140 master.cpp:3373] Deactivating agent 39ecafac-8c8f-4d59-974f-ac892e112d1c-S0
at slave(251)@10.3.1.5:59141 (mesos-bld-s1.zq4gs31qjdiunm1ryi1452nvnh.dx.internal.cloudapp.net)
I1002 18:59:23.198644 37024 hierarchical.cpp:690] Agent 39ecafac-8c8f-4d59-974f-ac892e112d1c-S0
deactivated
I1002 18:59:23.223640 36696 master.cpp:1163] Master terminating
I1002 18:59:23.226639 38428 hierarchical.cpp:626] Removed agent 39ecafac-8c8f-4d59-974f-ac892e112d1c-S0
W1002 18:59:23.240877 36696 master.hpp:2882] Failed to close HTTP pipe for 39ecafac-8c8f-4d59-974f-ac892e112d1c-0000
(default)
I1002 18:59:24.165506 39380 process.cpp:1068] Failed to accept socket: future discarded
```

- Mesos Reviewbot Windows


On Sept. 29, 2017, 12:48 p.m., Benno Evers wrote:
> 
> -----------------------------------------------------------
> This is an automatically generated e-mail. To reply, visit:
> https://reviews.apache.org/r/62213/
> -----------------------------------------------------------
> 
> (Updated Sept. 29, 2017, 12:48 p.m.)
> 
> 
> Review request for mesos, Andrei Budnik and Alexander Rukletsov.
> 
> 
> Bugs: MESOS-7941
>     https://issues.apache.org/jira/browse/MESOS-7941
> 
> 
> Repository: mesos
> 
> 
> Description
> -------
> 
> Fix unit tests that were broken by the additional TASK_STARTING update.
> 
> 
> Diffs
> -----
> 
>   src/tests/api_tests.cpp 3d0db3b6c6bfb088a79921c3841ad312dad1ee6a 
>   src/tests/check_tests.cpp fd15a47f1d67ad852d84d83aad54c9fa93c60bbb 
>   src/tests/command_executor_tests.cpp f706f55b5bfab824268498d95d775b216561cd66 
>   src/tests/container_logger_tests.cpp fb8e441bd3842b1840a384a025fa8e9ccbb22cf6 
>   src/tests/containerizer/environment_secret_isolator_tests.cpp cf7b9eb6fd76dbdd3650ea2ad5b9097cf490e948

>   src/tests/containerizer/posix_rlimits_isolator_tests.cpp 0030cd1e1f73422bef806bbc0453134e3d7840d8

>   src/tests/default_executor_tests.cpp 63952d97b76c3e16973705cb0b16140dd381b7ce 
>   src/tests/disk_quota_tests.cpp 742b6e1a6340d488f4bae8acbd09a3e575c72ad2 
>   src/tests/fault_tolerance_tests.cpp c34850aaa76289d822317f30e5da0e0cb7f115c6 
>   src/tests/health_check_tests.cpp f4b50b1cb505084f64bf2dd279d9189ca65c8cdc 
>   src/tests/master_tests.cpp 4c776012e84c34dda7410841e063faab2a84f2df 
>   src/tests/master_validation_tests.cpp f00dd9b6fcb963b995fa238766a531f073205ce9 
>   src/tests/oversubscription_tests.cpp 02b10d6689dd6f01510cd2d5db2bb76b4b190eca 
>   src/tests/partition_tests.cpp 0597bd2afaa60121245e0d43b81ac223257e377a 
>   src/tests/persistent_volume_endpoints_tests.cpp 7a24bf48e9d84bf31ad85397ac3e1b4e566cbc2c

>   src/tests/persistent_volume_tests.cpp 1b35af427a2561f6094560c7bc9387dcb948b781 
>   src/tests/reconciliation_tests.cpp 64a1d3da9f03b863551555c4734aef39e835b122 
>   src/tests/reservation_endpoints_tests.cpp 5a6e9a7f08a5306542830f359868b2c31f4820c6

>   src/tests/role_tests.cpp fc4c017dc59ab44a0ce0ea46f02eb6e1706ffb72 
>   src/tests/scheduler_tests.cpp 4eda96e50a505eb36588bbcf9c3ba76d9ede7839 
>   src/tests/slave_authorization_tests.cpp 4c7d37fd14c8f3e7a52d35fb685fb8f05cba1e70 
>   src/tests/slave_recovery_tests.cpp 30d8c23de4312cc386354ef6cb44a62055c70f64 
>   src/tests/slave_tests.cpp 2ff6daba236972a732618257b25dc3e7fa4dec60 
>   src/tests/teardown_tests.cpp 5eada4f4392b7c721f5efbd537b0e817d40c7a27 
> 
> 
> Diff: https://reviews.apache.org/r/62213/diff/5/
> 
> 
> Testing
> -------
> 
> 
> Thanks,
> 
> Benno Evers
> 
>


Mime
  • Unnamed multipart/alternative (inline, None, 0 bytes)
View raw message