mesos-reviews mailing list archives

Site index · List index
Message view « Date » · « Thread »
Top « Date » · « Thread »
From Mesos Reviewbot Windows <revi...@mesos.apache.org>
Subject Re: Review Request 61172: Added mesos.http and mesos.exceptions for CLI.
Date Sat, 30 Sep 2017 00:18:14 GMT

-----------------------------------------------------------
This is an automatically generated e-mail. To reply, visit:
https://reviews.apache.org/r/61172/#review186763
-----------------------------------------------------------



FAIL: Some Mesos tests failed.

Reviews applied: `['61172']`

Failed command: `C:\mesos\src\mesos-tests.exe --verbose --gtest_filter="-ContentType/MasterAPITest.EventAuthorizationFiltering/1"`

All the build artifacts available at: http://dcos-win.westus.cloudapp.azure.com/mesos-build/review/61172

Relevant logs:

- [mesos-tests-stdout.log](http://dcos-win.westus.cloudapp.azure.com/mesos-build/review/61172/logs/mesos-tests-stdout.log):

```
[ RUN      ] ContentType/SchedulerTest.SchedulerReconnect/0
[       OK ] ContentType/SchedulerTest.SchedulerReconnect/0 (249 ms)
[ RUN      ] ContentType/SchedulerTest.SchedulerReconnect/1
[       OK ] ContentType/SchedulerTest.SchedulerReconnect/1 (253 ms)
[----------] 30 tests from ContentType/SchedulerTest (26578 ms total)

[----------] 2 tests from ContentTypeAndSSLConfig/SchedulerSSLTest
[ RUN      ] ContentTypeAndSSLConfig/SchedulerSSLTest.RunTaskAndTeardown/0
[       OK ] ContentTypeAndSSLConfig/SchedulerSSLTest.RunTaskAndTeardown/0 (902 ms)
[ RUN      ] ContentTypeAndSSLConfig/SchedulerSSLTest.RunTaskAndTeardown/1
[       OK ] ContentTypeAndSSLConfig/SchedulerSSLTest.RunTaskAndTeardown/1 (1023 ms)
[----------] 2 tests from ContentTypeAndSSLConfig/SchedulerSSLTest (2053 ms total)

[----------] 2 tests from ContainerizerType/DefaultContainerDNSFlagTest
[ RUN      ] ContainerizerType/DefaultContainerDNSFlagTest.ValidateFlag/0
[       OK ] ContainerizerType/DefaultContainerDNSFlagTest.ValidateFlag/0 (133 ms)
[ RUN      ] ContainerizerType/DefaultContainerDNSFlagTest.ValidateFlag/1
[       OK ] ContainerizerType/DefaultContainerDNSFlagTest.ValidateFlag/1 (151 ms)
[----------] 2 tests from ContainerizerType/DefaultContainerDNSFlagTest (370 ms total)

[----------] Global test environment tear-down
[==========] 634 tests from 67 test cases ran. (358685 ms total)
[  PASSED  ] 633 tests.
[  FAILED  ] 1 test, listed below:
[  FAILED  ] MesosContainerizer/DefaultExecutorTest.TaskWithFileURI/0, where GetParam() =
"mesos"

 1 FAILED TEST
  YOU HAVE 182 DISABLED TESTS

```

- [mesos-tests-stderr.log](http://dcos-win.westus.cloudapp.azure.com/mesos-build/review/61172/logs/mesos-tests-stderr.log):

```
I0930 00:17:39.407632 31184 master.cpp:8438] Removing framework 29bea81c-7cc9-4cae-8b13-4e61edd45a51-0000
(default)
I0930 00:17:39.407632 31184 master.cpp:3317] Deactivating framework 29bea81c-7cc9-4cae-8b13-4e61edd45a51-0000
(default)
I0930 00:17:39.408632 30504 hierarchical.cpp:412] Deactivated framework 29bea81c-7cc9-4cae-8b13-4e61edd45a51-0000
I0930 00:17:39.408632 28900 slave.cpp:3239] Shutting down framework 29bea81c-7cc9-4cae-8b13-4e61edd45a51-0000
I0930 00:17:39.408632 31184 master.cpp:9136] Updating the state of task 5213cf5b-e0d5-4579-bdcf-84cb469c141b
of framework 29bea81c-7cc9-4cae-8b13-4e61edd45a51-0000 (latest state: TASK_KILLED, status
update state: TASK_KILLED)
I0930 00:17:39.408632 28900 slave.cpp:5746] Shutting down executor 'default' of framework
29bea81c-7cc9-4cae-8b13-4e61edd45a51-0000 (via HTTP)
I0930 00:17:39.412633 31184 master.cpp:9230] Removing task 5213cf5b-e0d5-4579-bdcf-84cb469c141b
with resources [{"allocation_info":{"role":"*"},"name":"cpus","scalar":{"value":2.0},"type":"SCALAR"},{"allocation_info":{"role":"*"},"name":"mem","scalar":{"value":1024.0},"type":"SCALAR"},{"allocation_info":{"role":"*"},"name":"disk","scalar":{"value":1024.0},"type":"SCALAR"},{"allocation_info":{"role":"*"},"name":"ports","ranges":{"range":[{"begin":31000,"end":32000}]},"type":"RANGES"}]
of framework 29bea81c-7cc9-4cae-8b13-4e61edd45a51-0000 on agent 29bea81c-7cc9-4cae-8b13-4e61edd45a51-S0
at slave(251)@10.3.1.7:55700 (mesos-bld-s2.zq4gs31qjdiunm1ryi1452nvnh.dx.internal.cloudapp.net)
I0930 00:17:39.426633 31184 master.cpp:9259] Removing executor 'default' with resources []
of framework 29bea81c-7cc9-4cae-8b13-4e61edd45a51-0000 on agent 29bea81c-7cc9-4cae-8b13-4e61edd45a51-S0
at slave(251)@10.3.1.7:55700 (mesos-bld-s2.zq4gs31qjdiunm1ryi1452nvnh.dx.internal.cloudapp.net)
E0930 00:17:39.444922 31364 scheduler.cpp:649] End-Of-File received from master. The master
closed the event stream
I0930 00:17:39.443634 28900 hierarchical.cpp:355] Removed framework 29bea81c-7cc9-4cae-8b13-4e61edd45a51-0000
I0930 00:17:39.445634 31248 scheduler.cpp:444] Re-detecting master
I0930 00:17:39.452633 31248 scheduler.cpp:470] New master detected at master@10.3.1.7:55700
I0930 00:17:39.468634 30652 slave.cpp:5411] Executor 'default' of framework 29bea81c-7cc9-4cae-8b13-4e61edd45a51-0000
exited with status 0
I0930 00:17:39.469635 30652 slave.cpp:5515] Cleaning up executor 'default' of framework 29bea81c-7cc9-4cae-8b13-4e61edd45a51-0000
(via HTTP)
W0930 00:17:39.469635 28900 master.cpp:7089] Ignoring unknown exited executor 'default' of
framework 29bea81c-7cc9-4cae-8b13-4e61edd45a51-0000 on agent 29bea81c-7cc9-4cae-8b13-4e61edd45a51-S0
at slave(251)@10.3.1.7:55700 (mesos-bld-s2.zq4gs31qjdiunm1ryi1452nvnh.dx.internal.cloudapp.net)
I0930 00:17:39.470635 31248 gc.cpp:90] Scheduling 'C:\Users\mesos\AppData\Local\Temp\2\v3junw\slaves\29bea81c-7cc9-4cae-8b13-4e61edd45a51-S0\frameworks\29bea81c-7cc9-4cae-8b13-4e61edd45a51-0000\executors\default\runs\9f970063-d337-47e6-93de-078b9f9794ce'
for gc 6.9999945528237days in the future
I0930 00:17:39.470635 30652 slave.cpp:5622] Cleaning up framework 29bea81c-7cc9-4cae-8b13-4e61edd45a51-0000
I0930 00:17:39.482637 30504 status_update_manager.cpp:285] Closing status update streams for
framework 29bea81c-7cc9-4cae-8b13-4e61edd45a51-0000
I0930 00:17:39.482637 31248 gc.cpp:90] Scheduling 'C:\Users\mesos\AppData\Local\Temp\2\v3junw\slaves\29bea81c-7cc9-4cae-8b13-4e61edd45a51-S0\frameworks\29bea81c-7cc9-4cae-8b13-4e61edd45a51-0000\executors\default'
for gc 6.9999945528237days in the future
I0930 00:17:39.483635 31248 gc.cpp:90] Scheduling 'C:\Users\mesos\AppData\Local\Temp\2\v3junw\slaves\29bea81c-7cc9-4cae-8b13-4e61edd45a51-S0\frameworks\29bea81c-7cc9-4cae-8b13-4e61edd45a51-0000'
for gc 6.99999440236148days in the future
I0930 00:17:39.483635 30652 slave.cpp:869] Agent terminating
I0930 00:17:39.496634 31364 master.cpp:1321] Agent 29bea81c-7cc9-4cae-8b13-4e61edd45a51-S0
at slave(251)@10.3.1.7:55700 (mesos-bld-s2.zq4gs31qjdiunm1ryi1452nvnh.dx.internal.cloudapp.net)
disconnected
I0930 00:17:39.496634 31364 master.cpp:3354] Disconnecting agent 29bea81c-7cc9-4cae-8b13-4e61edd45a51-S0
at slave(251)@10.3.1.7:55700 (mesos-bld-s2.zq4gs31qjdiunm1ryi1452nvnh.dx.internal.cloudapp.net)
I0930 00:17:39.496634 31364 master.cpp:3373] Deactivating agent 29bea81c-7cc9-4cae-8b13-4e61edd45a51-S0
at slave(251)@10.3.1.7:55700 (mesos-bld-s2.zq4gs31qjdiunm1ryi1452nvnh.dx.internal.cloudapp.net)
I0930 00:17:39.497635 28900 hierarchical.cpp:690] Agent 29bea81c-7cc9-4cae-8b13-4e61edd45a51-S0
deactivated
I0930 00:17:39.525638 31392 master.cpp:1163] Master terminating
I0930 00:17:39.528636 31364 hierarchical.cpp:626] Removed agent 29bea81c-7cc9-4cae-8b13-4e61edd45a51-S0
W0930 00:17:39.531636 31392 master.hpp:2882] Failed to close HTTP pipe for 29bea81c-7cc9-4cae-8b13-4e61edd45a51-0000
(default)
I0930 00:17:40.393668 27748 process.cpp:1068] Failed to accept socket: future discarded
```

- Mesos Reviewbot Windows


On Sept. 29, 2017, 9:25 p.m., Eric Chung wrote:
> 
> -----------------------------------------------------------
> This is an automatically generated e-mail. To reply, visit:
> https://reviews.apache.org/r/61172/
> -----------------------------------------------------------
> 
> (Updated Sept. 29, 2017, 9:25 p.m.)
> 
> 
> Review request for mesos, Armand Grillet, Jason Lai, and Kevin Klues.
> 
> 
> Repository: mesos
> 
> 
> Description
> -------
> 
> Part of MESOS-7310, this patch adds the mesos.http and mesos.exceptions
> modules, which provides a Resource class and its descendants for
> abstracting away common operations over http connectioins with JSON
> serialization.
> 
> 
> Diffs
> -----
> 
>   src/python/cli_new/bootstrap c84e549e59bc7a07b5b70c24c63bc0c16881e442 
>   src/python/lib/mesos/exceptions.py PRE-CREATION 
>   src/python/lib/mesos/http.py PRE-CREATION 
>   src/python/lib/requirements.in e69de29bb2d1d6434b8b29ae775ad8c2e48c5391 
>   src/python/lib/tests/conftest.py PRE-CREATION 
>   src/python/lib/tests/test_exceptions.py PRE-CREATION 
>   src/python/lib/tests/test_http.py PRE-CREATION 
>   src/python/lib/tox.ini 8ad030d2dbf1fb7a04f1eaadb587462b4ef3f054 
>   src/python/pylint.config 9f0361d160fa82038ccefcbc146e52f0af8f99e8 
> 
> 
> Diff: https://reviews.apache.org/r/61172/diff/6/
> 
> 
> Testing
> -------
> 
> install tox
> cd src/python/lib
> tox
> 
> 
> Thanks,
> 
> Eric Chung
> 
>


Mime
  • Unnamed multipart/alternative (inline, None, 0 bytes)
View raw message