mesos-reviews mailing list archives

Site index · List index
Message view « Date » · « Thread »
Top « Date » · « Thread »
From Mesos Reviewbot Windows <revi...@mesos.apache.org>
Subject Re: Review Request 62214: Added JavaScript linter.
Date Mon, 18 Sep 2017 18:15:12 GMT

-----------------------------------------------------------
This is an automatically generated e-mail. To reply, visit:
https://reviews.apache.org/r/62214/#review185582
-----------------------------------------------------------



FAIL: Some Mesos tests failed.

Reviews applied: `['62333', '62214']`

Failed command: `C:\mesos\src\mesos-tests.exe --verbose`

All the build artifacts available at: http://dcos-win.westus.cloudapp.azure.com/mesos-build/review/62214

Relevant logs:

- [mesos-tests-stdout.log](http://dcos-win.westus.cloudapp.azure.com/mesos-build/review/62214/logs/mesos-tests-stdout.log):

```
[ RUN      ] ContentType/SchedulerTest.SchedulerReconnect/0
[       OK ] ContentType/SchedulerTest.SchedulerReconnect/0 (258 ms)
[ RUN      ] ContentType/SchedulerTest.SchedulerReconnect/1
[       OK ] ContentType/SchedulerTest.SchedulerReconnect/1 (242 ms)
[----------] 30 tests from ContentType/SchedulerTest (25165 ms total)

[----------] 2 tests from ContentTypeAndSSLConfig/SchedulerSSLTest
[ RUN      ] ContentTypeAndSSLConfig/SchedulerSSLTest.RunTaskAndTeardown/0
[       OK ] ContentTypeAndSSLConfig/SchedulerSSLTest.RunTaskAndTeardown/0 (940 ms)
[ RUN      ] ContentTypeAndSSLConfig/SchedulerSSLTest.RunTaskAndTeardown/1
[       OK ] ContentTypeAndSSLConfig/SchedulerSSLTest.RunTaskAndTeardown/1 (1038 ms)
[----------] 2 tests from ContentTypeAndSSLConfig/SchedulerSSLTest (2056 ms total)

[----------] 2 tests from ContainerizerType/DefaultContainerDNSFlagTest
[ RUN      ] ContainerizerType/DefaultContainerDNSFlagTest.ValidateFlag/0
[       OK ] ContainerizerType/DefaultContainerDNSFlagTest.ValidateFlag/0 (137 ms)
[ RUN      ] ContainerizerType/DefaultContainerDNSFlagTest.ValidateFlag/1
[       OK ] ContainerizerType/DefaultContainerDNSFlagTest.ValidateFlag/1 (156 ms)
[----------] 2 tests from ContainerizerType/DefaultContainerDNSFlagTest (330 ms total)

[----------] Global test environment tear-down
[==========] 627 tests from 66 test cases ran. (348687 ms total)
[  PASSED  ] 626 tests.
[  FAILED  ] 1 test, listed below:
[  FAILED  ] ContentType/MasterAPITest.EventAuthorizationFiltering/1, where GetParam() = application/json

 1 FAILED TEST
  YOU HAVE 174 DISABLED TESTS

```

- [mesos-tests-stderr.log](http://dcos-win.westus.cloudapp.azure.com/mesos-build/review/62214/logs/mesos-tests-stderr.log):

```
I0918 18:14:37.250769 17416 master.cpp:8418] Removing framework 0f3fff57-6111-4c1d-b411-803faa77bdc2-0000
(default)
I0918 18:14:37.250769 17416 master.cpp:3267] Deactivating framework 0f3fff57-6111-4c1d-b411-803faa77bdc2-0000
(default)
I0918 18:14:37.250769 18928 hierarchical.cpp:412] Deactivated framework 0f3fff57-6111-4c1d-b411-803faa77bdc2-0000
I0918 18:14:37.251765 14296 slave.cpp:3235] Shutting down framework 0f3fff57-6111-4c1d-b411-803faa77bdc2-0000
I0918 18:14:37.251765 17416 master.cpp:8993] Updating the state of task e72061a8-8483-4856-8749-889ad9823e10
of framework 0f3fff57-6111-4c1d-b411-803faa77bdc2-0000 (latest state: TASK_KILLED, status
update state: TASK_KILLED)
I0918 18:14:37.262728 14296 slave.cpp:5731] Shutting down executor 'default' of framework
0f3fff57-6111-4c1d-b411-803faa77bdc2-0000 (via HTTP)
I0918 18:14:37.265743 17416 master.cpp:9087] Removing task e72061a8-8483-4856-8749-889ad9823e10
with resources [{"allocation_info":{"role":"*"},"name":"cpus","scalar":{"value":2.0},"type":"SCALAR"},{"allocation_info":{"role":"*"},"name":"mem","scalar":{"value":1024.0},"type":"SCALAR"},{"allocation_info":{"role":"*"},"name":"disk","scalar":{"value":1024.0},"type":"SCALAR"},{"allocation_info":{"role":"*"},"name":"ports","ranges":{"range":[{"begin":31000,"end":32000}]},"type":"RANGES"}]
of framework 0f3fff57-6111-4c1d-b411-803faa77bdc2-0000 on agent 0f3fff57-6111-4c1d-b411-803faa77bdc2-S0
at slave(254)@10.3.1.5:50032 (mesos-bld-s1.zq4gs31qjdiunm1ryi1452nvnh.dx.internal.cloudapp.net)
I0918 18:14:37.289737 17416 master.cpp:9116] Removing executor 'default' with resources []
of framework 0f3fff57-6111-4c1d-b411-803faa77bdc2-0000 on agent 0f3fff57-6111-4c1d-b411-803faa77bdc2-S0
at slave(254)@10.3.1.5:50032 (mesos-bld-s1.zq4gs31qjdiunm1ryi1452nvnh.dx.internal.cloudapp.net)
I0918 18:14:37.293740 11668 hierarchical.cpp:355] Removed framework 0f3fff57-6111-4c1d-b411-803faa77bdc2-0000
E0918 18:14:37.293740 18672 scheduler.cpp:649] End-Of-File received from master. The master
closed the event stream
I0918 18:14:37.295739 19356 scheduler.cpp:444] Re-detecting master
I0918 18:14:37.297740 19356 scheduler.cpp:470] New master detected at master@10.3.1.5:50032
I0918 18:14:37.315742 18200 slave.cpp:5407] Executor 'default' of framework 0f3fff57-6111-4c1d-b411-803faa77bdc2-0000
exited with status 0
W0918 18:14:37.316742 11668 master.cpp:7021] Ignoring unknown exited executor 'default' of
framework 0f3fff57-6111-4c1d-b411-803faa77bdc2-0000 on agent 0f3fff57-6111-4c1d-b411-803faa77bdc2-S0
at slave(254)@10.3.1.5:50032 (mesos-bld-s1.zq4gs31qjdiunm1ryi1452nvnh.dx.internal.cloudapp.net)
I0918 18:14:37.315742 18200 slave.cpp:5511] Cleaning up executor 'default' of framework 0f3fff57-6111-4c1d-b411-803faa77bdc2-0000
(via HTTP)
I0918 18:14:37.324743 17416 gc.cpp:91] Scheduling 'C:\Users\mesos\AppData\Local\Temp\2\i9wTFe\slaves\0f3fff57-6111-4c1d-b411-803faa77bdc2-S0\frameworks\0f3fff57-6111-4c1d-b411-803faa77bdc2-0000\executors\default\runs\ce8375a8-44e5-49d4-b996-07a0a3989f79'
for gc 6.99999624138963days in the future
I0918 18:14:37.326743 18200 slave.cpp:5607] Cleaning up framework 0f3fff57-6111-4c1d-b411-803faa77bdc2-0000
I0918 18:14:37.325743 19356 gc.cpp:91] Scheduling 'C:\Users\mesos\AppData\Local\Temp\2\i9wTFe\slaves\0f3fff57-6111-4c1d-b411-803faa77bdc2-S0\frameworks\0f3fff57-6111-4c1d-b411-803faa77bdc2-0000\executors\default'
for gc 6.99999622981333days in the future
I0918 18:14:37.326743 18928 status_update_manager.cpp:285] Closing status update streams for
framework 0f3fff57-6111-4c1d-b411-803faa77bdc2-0000
I0918 18:14:37.327744 18868 gc.cpp:91] Scheduling 'C:\Users\mesos\AppData\Local\Temp\2\i9wTFe\slaves\0f3fff57-6111-4c1d-b411-803faa77bdc2-S0\frameworks\0f3fff57-6111-4c1d-b411-803faa77bdc2-0000'
for gc 6.99999621824days in the future
I0918 18:14:37.327744 18200 slave.cpp:861] Agent terminating
I0918 18:14:37.339745 11668 master.cpp:1321] Agent 0f3fff57-6111-4c1d-b411-803faa77bdc2-S0
at slave(254)@10.3.1.5:50032 (mesos-bld-s1.zq4gs31qjdiunm1ryi1452nvnh.dx.internal.cloudapp.net)
disconnected
I0918 18:14:37.339745 11668 master.cpp:3304] Disconnecting agent 0f3fff57-6111-4c1d-b411-803faa77bdc2-S0
at slave(254)@10.3.1.5:50032 (mesos-bld-s1.zq4gs31qjdiunm1ryi1452nvnh.dx.internal.cloudapp.net)
I0918 18:14:37.340744 11668 master.cpp:3323] Deactivating agent 0f3fff57-6111-4c1d-b411-803faa77bdc2-S0
at slave(254)@10.3.1.5:50032 (mesos-bld-s1.zq4gs31qjdiunm1ryi1452nvnh.dx.internal.cloudapp.net)
I0918 18:14:37.340744 18200 hierarchical.cpp:690] Agent 0f3fff57-6111-4c1d-b411-803faa77bdc2-S0
deactivated
I0918 18:14:37.369747 16644 master.cpp:1163] Master terminating
I0918 18:14:37.372747 11668 hierarchical.cpp:626] Removed agent 0f3fff57-6111-4c1d-b411-803faa77bdc2-S0
W0918 18:14:37.381748 16644 master.hpp:2761] Failed to close HTTP pipe for 0f3fff57-6111-4c1d-b411-803faa77bdc2-0000
(default)
I0918 18:14:38.116504 20172 process.cpp:1068] Failed to accept socket: future discarded
```

- Mesos Reviewbot Windows


On Sept. 18, 2017, 3:10 p.m., Armand Grillet wrote:
> 
> -----------------------------------------------------------
> This is an automatically generated e-mail. To reply, visit:
> https://reviews.apache.org/r/62214/
> -----------------------------------------------------------
> 
> (Updated Sept. 18, 2017, 3:10 p.m.)
> 
> 
> Review request for mesos, Benjamin Mahler and Kevin Klues.
> 
> 
> Bugs: MESOS-7924
>     https://issues.apache.org/jira/browse/MESOS-7924
> 
> 
> Repository: mesos
> 
> 
> Description
> -------
> 
> This linter runs when changes on a JavaScript file are being committed.
> The linter used is ESLint with a configuration based on our current JS
> code base. The linter and its dependencies (i.e. Node.js) are installed
> in a environment using Virtualenv and then Nodeenv.
> 
> 
> Diffs
> -----
> 
>   src/webui/.eslintrc.js PRE-CREATION 
>   src/webui/.gitignore PRE-CREATION 
>   src/webui/bootstrap PRE-CREATION 
>   src/webui/pip-requirements.txt PRE-CREATION 
>   support/mesos-style.py cf37d9f4da4ab90b92f0136a1dcd5dd8bbae5785 
> 
> 
> Diff: https://reviews.apache.org/r/62214/diff/2/
> 
> 
> Testing
> -------
> 
> Following this commit, I have tried to commit a change on a JavaScript file and checked
that ESLinter was correctly running.
> 
> 
> Thanks,
> 
> Armand Grillet
> 
>


Mime
  • Unnamed multipart/alternative (inline, None, 0 bytes)
View raw message