mesos-reviews mailing list archives

Site index · List index
Message view « Date » · « Thread »
Top « Date » · « Thread »
From Mesos Reviewbot Windows <revi...@mesos.apache.org>
Subject Re: Review Request 62365: Added the missing isolators to the doc.
Date Sat, 16 Sep 2017 03:18:16 GMT

-----------------------------------------------------------
This is an automatically generated e-mail. To reply, visit:
https://reviews.apache.org/r/62365/#review185518
-----------------------------------------------------------



FAIL: Some Mesos tests failed.

Reviews applied: `['62295', '62296', '62297', '62298', '62299', '62300', '62301', '62302',
'62303', '62304', '62305', '62306', '62307', '62308', '62322', '62365']`

Failed command: `C:\mesos\src\mesos-tests.exe --verbose`

All the build artifacts available at: http://dcos-win.westus.cloudapp.azure.com/mesos-build/review/62365

Relevant logs:

- [mesos-tests-stdout.log](http://dcos-win.westus.cloudapp.azure.com/mesos-build/review/62365/logs/mesos-tests-stdout.log):

```
[ RUN      ] ContentType/SchedulerTest.SchedulerReconnect/0
[       OK ] ContentType/SchedulerTest.SchedulerReconnect/0 (243 ms)
[ RUN      ] ContentType/SchedulerTest.SchedulerReconnect/1
[       OK ] ContentType/SchedulerTest.SchedulerReconnect/1 (273 ms)
[----------] 30 tests from ContentType/SchedulerTest (26795 ms total)

[----------] 2 tests from ContentTypeAndSSLConfig/SchedulerSSLTest
[ RUN      ] ContentTypeAndSSLConfig/SchedulerSSLTest.RunTaskAndTeardown/0
[       OK ] ContentTypeAndSSLConfig/SchedulerSSLTest.RunTaskAndTeardown/0 (990 ms)
[ RUN      ] ContentTypeAndSSLConfig/SchedulerSSLTest.RunTaskAndTeardown/1
[       OK ] ContentTypeAndSSLConfig/SchedulerSSLTest.RunTaskAndTeardown/1 (1136 ms)
[----------] 2 tests from ContentTypeAndSSLConfig/SchedulerSSLTest (2244 ms total)

[----------] 2 tests from ContainerizerType/DefaultContainerDNSFlagTest
[ RUN      ] ContainerizerType/DefaultContainerDNSFlagTest.ValidateFlag/0
[       OK ] ContainerizerType/DefaultContainerDNSFlagTest.ValidateFlag/0 (135 ms)
[ RUN      ] ContainerizerType/DefaultContainerDNSFlagTest.ValidateFlag/1
[       OK ] ContainerizerType/DefaultContainerDNSFlagTest.ValidateFlag/1 (146 ms)
[----------] 2 tests from ContainerizerType/DefaultContainerDNSFlagTest (337 ms total)

[----------] Global test environment tear-down
[==========] 627 tests from 66 test cases ran. (358894 ms total)
[  PASSED  ] 626 tests.
[  FAILED  ] 1 test, listed below:
[  FAILED  ] ContentType/MasterAPITest.EventAuthorizationFiltering/1, where GetParam() = application/json

 1 FAILED TEST
  YOU HAVE 174 DISABLED TESTS

```

- [mesos-tests-stderr.log](http://dcos-win.westus.cloudapp.azure.com/mesos-build/review/62365/logs/mesos-tests-stderr.log):

```
I0916 03:17:32.219786 11540 master.cpp:8418] Removing framework b7d1fd66-6eb0-4234-8931-a099bed0aec0-0000
(default)
I0916 03:17:32.219786 11540 master.cpp:3267] Deactivating framework b7d1fd66-6eb0-4234-8931-a099bed0aec0-0000
(default)
I0916 03:17:32.220525 16864 hierarchical.cpp:412] Deactivated framework b7d1fd66-6eb0-4234-8931-a099bed0aec0-0000
I0916 03:17:32.220525 16692 slave.cpp:3235] Shutting down framework b7d1fd66-6eb0-4234-8931-a099bed0aec0-0000
I0916 03:17:32.220525 11540 master.cpp:8993] Updating the state of task 042cb13d-4534-42fb-86f9-c89167c5ce0a
of framework b7d1fd66-6eb0-4234-8931-a099bed0aec0-0000 (latest state: TASK_KILLED, status
update state: TASK_KILLED)
I0916 03:17:32.221482 16692 slave.cpp:5731] Shutting down executor 'default' of framework
b7d1fd66-6eb0-4234-8931-a099bed0aec0-0000 (via HTTP)
I0916 03:17:32.228488 11540 master.cpp:9087] Removing task 042cb13d-4534-42fb-86f9-c89167c5ce0a
with resources [{"allocation_info":{"role":"*"},"name":"cpus","scalar":{"value":2.0},"type":"SCALAR"},{"allocation_info":{"role":"*"},"name":"mem","scalar":{"value":1024.0},"type":"SCALAR"},{"allocation_info":{"role":"*"},"name":"disk","scalar":{"value":1024.0},"type":"SCALAR"},{"allocation_info":{"role":"*"},"name":"ports","ranges":{"range":[{"begin":31000,"end":32000}]},"type":"RANGES"}]
of framework b7d1fd66-6eb0-4234-8931-a099bed0aec0-0000 on agent b7d1fd66-6eb0-4234-8931-a099bed0aec0-S0
at slave(254)@10.3.1.7:52201 (mesos-bld-s2.zq4gs31qjdiunm1ryi1452nvnh.dx.internal.cloudapp.net)
I0916 03:17:32.269482 11540 master.cpp:9116] Removing executor 'default' with resources []
of framework b7d1fd66-6eb0-4234-8931-a099bed0aec0-0000 on agent b7d1fd66-6eb0-4234-8931-a099bed0aec0-S0
at slave(254)@10.3.1.7:52201 (mesos-bld-s2.zq4gs31qjdiunm1ryi1452nvnh.dx.internal.cloudapp.net)
I0916 03:17:32.272483 14916 hierarchical.cpp:355] Removed framework b7d1fd66-6eb0-4234-8931-a099bed0aec0-0000
E0916 03:17:32.273483 16864 scheduler.cpp:649] End-Of-File received from master. The master
closed the event stream
I0916 03:17:32.284483 16864 scheduler.cpp:444] Re-detecting master
I0916 03:17:32.286484 11540 scheduler.cpp:470] New master detected at master@10.3.1.7:52201
I0916 03:17:32.302484 11540 slave.cpp:5407] Executor 'default' of framework b7d1fd66-6eb0-4234-8931-a099bed0aec0-0000
exited with status 0
I0916 03:17:32.302484 11540 slave.cpp:5511] Cleaning up executor 'default' of framework b7d1fd66-6eb0-4234-8931-a099bed0aec0-0000
(via HTTP)
W0916 03:17:32.303483 14084 master.cpp:7021] Ignoring unknown exited executor 'default' of
framework b7d1fd66-6eb0-4234-8931-a099bed0aec0-0000 on agent b7d1fd66-6eb0-4234-8931-a099bed0aec0-S0
at slave(254)@10.3.1.7:52201 (mesos-bld-s2.zq4gs31qjdiunm1ryi1452nvnh.dx.internal.cloudapp.net)
I0916 03:17:32.304482 16864 gc.cpp:91] Scheduling 'C:\Users\mesos\AppData\Local\Temp\2\BXb2uw\slaves\b7d1fd66-6eb0-4234-8931-a099bed0aec0-S0\frameworks\b7d1fd66-6eb0-4234-8931-a099bed0aec0-0000\executors\default\runs\a2e7844e-1a7f-47e6-96ec-f9d93d2b3fa6'
for gc 6.9999849018163days in the future
I0916 03:17:32.306483 11540 slave.cpp:5607] Cleaning up framework b7d1fd66-6eb0-4234-8931-a099bed0aec0-0000
I0916 03:17:32.352973 16868 status_update_manager.cpp:285] Closing status update streams for
framework b7d1fd66-6eb0-4234-8931-a099bed0aec0-0000
I0916 03:17:32.352973 16864 gc.cpp:91] Scheduling 'C:\Users\mesos\AppData\Local\Temp\2\BXb2uw\slaves\b7d1fd66-6eb0-4234-8931-a099bed0aec0-S0\frameworks\b7d1fd66-6eb0-4234-8931-a099bed0aec0-0000\executors\default'
for gc 6.9999848899763days in the future
I0916 03:17:32.353984 16692 gc.cpp:91] Scheduling 'C:\Users\mesos\AppData\Local\Temp\2\BXb2uw\slaves\b7d1fd66-6eb0-4234-8931-a099bed0aec0-S0\frameworks\b7d1fd66-6eb0-4234-8931-a099bed0aec0-0000'
for gc 6.99998432887704days in the future
I0916 03:17:32.353984 11540 slave.cpp:861] Agent terminating
I0916 03:17:32.354982 14916 master.cpp:1321] Agent b7d1fd66-6eb0-4234-8931-a099bed0aec0-S0
at slave(254)@10.3.1.7:52201 (mesos-bld-s2.zq4gs31qjdiunm1ryi1452nvnh.dx.internal.cloudapp.net)
disconnected
I0916 03:17:32.412981 14916 master.cpp:3304] Disconnecting agent b7d1fd66-6eb0-4234-8931-a099bed0aec0-S0
at slave(254)@10.3.1.7:52201 (mesos-bld-s2.zq4gs31qjdiunm1ryi1452nvnh.dx.internal.cloudapp.net)
I0916 03:17:32.413982 14916 master.cpp:3323] Deactivating agent b7d1fd66-6eb0-4234-8931-a099bed0aec0-S0
at slave(254)@10.3.1.7:52201 (mesos-bld-s2.zq4gs31qjdiunm1ryi1452nvnh.dx.internal.cloudapp.net)
I0916 03:17:32.413982 14916 master.cpp:1163] Master terminating
I0916 03:17:32.413982 11540 hierarchical.cpp:690] Agent b7d1fd66-6eb0-4234-8931-a099bed0aec0-S0
deactivated
I0916 03:17:32.415982 11540 hierarchical.cpp:626] Removed agent b7d1fd66-6eb0-4234-8931-a099bed0aec0-S0
W0916 03:17:32.425982 16464 master.hpp:2761] Failed to close HTTP pipe for b7d1fd66-6eb0-4234-8931-a099bed0aec0-0000
(default)
I0916 03:17:33.119990 14112 process.cpp:1068] Failed to accept socket: future discarded
```

- Mesos Reviewbot Windows


On Sept. 16, 2017, 1:10 a.m., Jie Yu wrote:
> 
> -----------------------------------------------------------
> This is an automatically generated e-mail. To reply, visit:
> https://reviews.apache.org/r/62365/
> -----------------------------------------------------------
> 
> (Updated Sept. 16, 2017, 1:10 a.m.)
> 
> 
> Review request for mesos, Gilbert Song and James Peach.
> 
> 
> Repository: mesos
> 
> 
> Description
> -------
> 
> Added the missing isolators to the doc.
> 
> 
> Diffs
> -----
> 
>   docs/mesos-containerizer.md feaaa556c9646435c6c9d677569962576ebf4c74 
> 
> 
> Diff: https://reviews.apache.org/r/62365/diff/1/
> 
> 
> Testing
> -------
> 
> 
> Thanks,
> 
> Jie Yu
> 
>


Mime
  • Unnamed multipart/alternative (inline, None, 0 bytes)
View raw message