mesos-reviews mailing list archives

Site index · List index
Message view « Date » · « Thread »
Top « Date » · « Thread »
From Mesos Reviewbot Windows <revi...@mesos.apache.org>
Subject Re: Review Request 62037: Added logging::initialize to main functions that use glog.
Date Fri, 15 Sep 2017 16:45:27 GMT

-----------------------------------------------------------
This is an automatically generated e-mail. To reply, visit:
https://reviews.apache.org/r/62037/#review185495
-----------------------------------------------------------



FAIL: Some Mesos tests failed.

Reviews applied: `['62018', '62037']`

Failed command: `C:\mesos\src\mesos-tests.exe --verbose`

All the build artifacts available at: http://dcos-win.westus.cloudapp.azure.com/mesos-build/review/62037

Relevant logs:

- [mesos-tests-stdout.log](http://dcos-win.westus.cloudapp.azure.com/mesos-build/review/62037/logs/mesos-tests-stdout.log):

```
[ RUN      ] ContentType/SchedulerTest.SchedulerReconnect/0
[       OK ] ContentType/SchedulerTest.SchedulerReconnect/0 (249 ms)
[ RUN      ] ContentType/SchedulerTest.SchedulerReconnect/1
[       OK ] ContentType/SchedulerTest.SchedulerReconnect/1 (243 ms)
[----------] 30 tests from ContentType/SchedulerTest (27449 ms total)

[----------] 2 tests from ContentTypeAndSSLConfig/SchedulerSSLTest
[ RUN      ] ContentTypeAndSSLConfig/SchedulerSSLTest.RunTaskAndTeardown/0
[       OK ] ContentTypeAndSSLConfig/SchedulerSSLTest.RunTaskAndTeardown/0 (931 ms)
[ RUN      ] ContentTypeAndSSLConfig/SchedulerSSLTest.RunTaskAndTeardown/1
[       OK ] ContentTypeAndSSLConfig/SchedulerSSLTest.RunTaskAndTeardown/1 (1115 ms)
[----------] 2 tests from ContentTypeAndSSLConfig/SchedulerSSLTest (2250 ms total)

[----------] 2 tests from ContainerizerType/DefaultContainerDNSFlagTest
[ RUN      ] ContainerizerType/DefaultContainerDNSFlagTest.ValidateFlag/0
[       OK ] ContainerizerType/DefaultContainerDNSFlagTest.ValidateFlag/0 (136 ms)
[ RUN      ] ContainerizerType/DefaultContainerDNSFlagTest.ValidateFlag/1
[       OK ] ContainerizerType/DefaultContainerDNSFlagTest.ValidateFlag/1 (151 ms)
[----------] 2 tests from ContainerizerType/DefaultContainerDNSFlagTest (342 ms total)

[----------] Global test environment tear-down
[==========] 627 tests from 66 test cases ran. (370182 ms total)
[  PASSED  ] 626 tests.
[  FAILED  ] 1 test, listed below:
[  FAILED  ] ContentType/MasterAPITest.EventAuthorizationFiltering/1, where GetParam() = application/json

 1 FAILED TEST
  YOU HAVE 174 DISABLED TESTS

```

- [mesos-tests-stderr.log](http://dcos-win.westus.cloudapp.azure.com/mesos-build/review/62037/logs/mesos-tests-stderr.log):

```
I0915 16:44:50.503223 15272 master.cpp:8418] Removing framework 62b4caf3-5753-4d21-ad60-720441ad6c31-0000
(default)
I0915 16:44:50.504225 15272 master.cpp:3267] Deactivating framework 62b4caf3-5753-4d21-ad60-720441ad6c31-0000
(default)
I0915 16:44:50.504225 11732 hierarchical.cpp:412] Deactivated framework 62b4caf3-5753-4d21-ad60-720441ad6c31-0000
I0915 16:44:50.505224 16068 slave.cpp:3235] Shutting down framework 62b4caf3-5753-4d21-ad60-720441ad6c31-0000
I0915 16:44:50.505224 15272 master.cpp:8993] Updating the state of task 2a5662c9-cb96-408a-995c-c0e281f8c75a
of framework 62b4caf3-5753-4d21-ad60-720441ad6c31-0000 (latest state: TASK_KILLED, status
update state: TASK_KILLED)
I0915 16:44:50.505224 16068 slave.cpp:5731] Shutting down executor 'default' of framework
62b4caf3-5753-4d21-ad60-720441ad6c31-0000 (via HTTP)
I0915 16:44:50.522230 15272 master.cpp:9087] Removing task 2a5662c9-cb96-408a-995c-c0e281f8c75a
with resources [{"allocation_info":{"role":"*"},"name":"cpus","scalar":{"value":2.0},"type":"SCALAR"},{"allocation_info":{"role":"*"},"name":"mem","scalar":{"value":1024.0},"type":"SCALAR"},{"allocation_info":{"role":"*"},"name":"disk","scalar":{"value":1024.0},"type":"SCALAR"},{"allocation_info":{"role":"*"},"name":"ports","ranges":{"range":[{"begin":31000,"end":32000}]},"type":"RANGES"}]
of framework 62b4caf3-5753-4d21-ad60-720441ad6c31-0000 on agent 62b4caf3-5753-4d21-ad60-720441ad6c31-S0
at slave(254)@10.3.1.5:61914 (mesos-bld-s1.zq4gs31qjdiunm1ryi1452nvnh.dx.internal.cloudapp.net)
I0915 16:44:50.533232 15272 master.cpp:9116] Removing executor 'default' with resources []
of framework 62b4caf3-5753-4d21-ad60-720441ad6c31-0000 on agent 62b4caf3-5753-4d21-ad60-720441ad6c31-S0
at slave(254)@10.3.1.5:61914 (mesos-bld-s1.zq4gs31qjdiunm1ryi1452nvnh.dx.internal.cloudapp.net)
I0915 16:44:50.546226 11732 hierarchical.cpp:355] Removed framework 62b4caf3-5753-4d21-ad60-720441ad6c31-0000
E0915 16:44:50.546226 18336 scheduler.cpp:649] End-Of-File received from master. The master
closed the event stream
I0915 16:44:50.548228 13304 scheduler.cpp:444] Re-detecting master
I0915 16:44:50.550227 13304 scheduler.cpp:470] New master detected at master@10.3.1.5:61914
I0915 16:44:50.562228 11732 slave.cpp:5407] Executor 'default' of framework 62b4caf3-5753-4d21-ad60-720441ad6c31-0000
exited with status 0
I0915 16:44:50.562228 11732 slave.cpp:5511] Cleaning up executor 'default' of framework 62b4caf3-5753-4d21-ad60-720441ad6c31-0000
(via HTTP)
W0915 16:44:50.563228 18336 master.cpp:7021] Ignoring unknown exited executor 'default' of
framework 62b4caf3-5753-4d21-ad60-720441ad6c31-0000 on agent 62b4caf3-5753-4d21-ad60-720441ad6c31-S0
at slave(254)@10.3.1.5:61914 (mesos-bld-s1.zq4gs31qjdiunm1ryi1452nvnh.dx.internal.cloudapp.net)
I0915 16:44:50.564229 18252 gc.cpp:91] Scheduling 'C:\Users\mesos\AppData\Local\Temp\2\7NihD0\slaves\62b4caf3-5753-4d21-ad60-720441ad6c31-S0\frameworks\62b4caf3-5753-4d21-ad60-720441ad6c31-0000\executors\default\runs\560d5780-7503-4739-83dc-0942c9bd59d0'
for gc 6.99999346957037days in the future
I0915 16:44:50.569231 11732 slave.cpp:5607] Cleaning up framework 62b4caf3-5753-4d21-ad60-720441ad6c31-0000
I0915 16:44:50.573245 16420 status_update_manager.cpp:285] Closing status update streams for
framework 62b4caf3-5753-4d21-ad60-720441ad6c31-0000
I0915 16:44:50.573245 18252 gc.cpp:91] Scheduling 'C:\Users\mesos\AppData\Local\Temp\2\7NihD0\slaves\62b4caf3-5753-4d21-ad60-720441ad6c31-S0\frameworks\62b4caf3-5753-4d21-ad60-720441ad6c31-0000\executors\default'
for gc 6.99999341166815days in the future
I0915 16:44:50.574229 11732 slave.cpp:861] Agent terminating
I0915 16:44:50.574229 18252 gc.cpp:91] Scheduling 'C:\Users\mesos\AppData\Local\Temp\2\7NihD0\slaves\62b4caf3-5753-4d21-ad60-720441ad6c31-S0\frameworks\62b4caf3-5753-4d21-ad60-720441ad6c31-0000'
for gc 6.99999335381926days in the future
I0915 16:44:50.589727 16068 master.cpp:1321] Agent 62b4caf3-5753-4d21-ad60-720441ad6c31-S0
at slave(254)@10.3.1.5:61914 (mesos-bld-s1.zq4gs31qjdiunm1ryi1452nvnh.dx.internal.cloudapp.net)
disconnected
I0915 16:44:50.589727 16068 master.cpp:3304] Disconnecting agent 62b4caf3-5753-4d21-ad60-720441ad6c31-S0
at slave(254)@10.3.1.5:61914 (mesos-bld-s1.zq4gs31qjdiunm1ryi1452nvnh.dx.internal.cloudapp.net)
I0915 16:44:50.589727 16068 master.cpp:3323] Deactivating agent 62b4caf3-5753-4d21-ad60-720441ad6c31-S0
at slave(254)@10.3.1.5:61914 (mesos-bld-s1.zq4gs31qjdiunm1ryi1452nvnh.dx.internal.cloudapp.net)
I0915 16:44:50.590726 11732 hierarchical.cpp:690] Agent 62b4caf3-5753-4d21-ad60-720441ad6c31-S0
deactivated
I0915 16:44:50.615727 17372 master.cpp:1163] Master terminating
I0915 16:44:50.631728 16068 hierarchical.cpp:626] Removed agent 62b4caf3-5753-4d21-ad60-720441ad6c31-S0
W0915 16:44:50.639729 17372 master.hpp:2761] Failed to close HTTP pipe for 62b4caf3-5753-4d21-ad60-720441ad6c31-0000
(default)
I0915 16:44:51.445627  9072 process.cpp:1068] Failed to accept socket: future discarded
```

- Mesos Reviewbot Windows


On Sept. 14, 2017, 8:36 a.m., Armand Grillet wrote:
> 
> -----------------------------------------------------------
> This is an automatically generated e-mail. To reply, visit:
> https://reviews.apache.org/r/62037/
> -----------------------------------------------------------
> 
> (Updated Sept. 14, 2017, 8:36 a.m.)
> 
> 
> Review request for mesos, Andrei Budnik and Alexander Rukletsov.
> 
> 
> Bugs: MESOS-7586
>     https://issues.apache.org/jira/browse/MESOS-7586
> 
> 
> Repository: mesos
> 
> 
> Description
> -------
> 
> This change reduces the number of messages "WARNING: Logging
> before InitGoogleLogging() is written to STDERR".
> 
> 
> Diffs
> -----
> 
>   src/checks/tcp_connect.cpp 3cb9077b9f39f69fdc152280e5b180b88e772648 
>   src/cli/execute.cpp e844fa46a43bdfb08246be929b7913a7997f18df 
>   src/cli/resolve.cpp b3cba87f61dbff0e99291775a4d0908bb35ce811 
>   src/examples/balloon_framework.cpp a63dbab2b478b28738940114bd157a56b49d473b 
>   src/examples/disk_full_framework.cpp 2572c72ded86d4befc1dc137e264dfe6ff64a357 
>   src/examples/dynamic_reservation_framework.cpp bb6f58ba8fb87ae37d4ae971c192a204d5a656c5

>   src/examples/long_lived_framework.cpp da632040ece591717a38b44158b3eedd9f0ae7c4 
>   src/examples/no_executor_framework.cpp 2ca240b4c998f0e33e7b09dbad9f4a7bfa0583cc 
>   src/examples/test_framework.cpp a6b38f02cc29682e3d3e1adf83baea061feda9e7 
>   src/examples/test_http_framework.cpp 693dd47694678e7439f9d4ab0ff77b93950edf6e 
>   src/launcher/fetcher.cpp 42980f5a4a40b72f754156469e9fe60a952d1d87 
>   src/slave/container_loggers/logrotate.cpp 61484b18f4615e85925b26d999afb5ac3b7e32a5

>   src/slave/containerizer/mesos/io/switchboard_main.cpp fa0b29667258b6b6fb7381d8226b6dda0062629e

>   src/usage/main.cpp 5ad4a3ba7959e4a9b3fa05f5a2f49b02f94a0cf0 
> 
> 
> Diff: https://reviews.apache.org/r/62037/diff/5/
> 
> 
> Testing
> -------
> 
> ```
> make check
> ```
> 
> Had an issue with ExamplesTest.DiskFullFramework that is not related.
> 
> 
> Thanks,
> 
> Armand Grillet
> 
>


Mime
  • Unnamed multipart/alternative (inline, None, 0 bytes)
View raw message