mesos-reviews mailing list archives

Site index · List index
Message view « Date » · « Thread »
Top « Date » · « Thread »
From Mesos Reviewbot Windows <revi...@mesos.apache.org>
Subject Re: Review Request 62214: Added JavaScript linter.
Date Thu, 14 Sep 2017 21:40:00 GMT

-----------------------------------------------------------
This is an automatically generated e-mail. To reply, visit:
https://reviews.apache.org/r/62214/#review185453
-----------------------------------------------------------



FAIL: Some Mesos tests failed.

Reviews applied: `['62332', '62333', '62214']`

Failed command: `C:\mesos\src\mesos-tests.exe --verbose`

All the build artifacts available at: http://dcos-win.westus.cloudapp.azure.com/mesos-build/review/62214

Relevant logs:

- [mesos-tests-stdout.log](http://dcos-win.westus.cloudapp.azure.com/mesos-build/review/62214/logs/mesos-tests-stdout.log):

```
[ RUN      ] ContentType/SchedulerTest.SchedulerReconnect/0
[       OK ] ContentType/SchedulerTest.SchedulerReconnect/0 (241 ms)
[ RUN      ] ContentType/SchedulerTest.SchedulerReconnect/1
[       OK ] ContentType/SchedulerTest.SchedulerReconnect/1 (240 ms)
[----------] 30 tests from ContentType/SchedulerTest (24624 ms total)

[----------] 2 tests from ContentTypeAndSSLConfig/SchedulerSSLTest
[ RUN      ] ContentTypeAndSSLConfig/SchedulerSSLTest.RunTaskAndTeardown/0
[       OK ] ContentTypeAndSSLConfig/SchedulerSSLTest.RunTaskAndTeardown/0 (896 ms)
[ RUN      ] ContentTypeAndSSLConfig/SchedulerSSLTest.RunTaskAndTeardown/1
[       OK ] ContentTypeAndSSLConfig/SchedulerSSLTest.RunTaskAndTeardown/1 (989 ms)
[----------] 2 tests from ContentTypeAndSSLConfig/SchedulerSSLTest (1968 ms total)

[----------] 2 tests from ContainerizerType/DefaultContainerDNSFlagTest
[ RUN      ] ContainerizerType/DefaultContainerDNSFlagTest.ValidateFlag/0
[       OK ] ContainerizerType/DefaultContainerDNSFlagTest.ValidateFlag/0 (138 ms)
[ RUN      ] ContainerizerType/DefaultContainerDNSFlagTest.ValidateFlag/1
[       OK ] ContainerizerType/DefaultContainerDNSFlagTest.ValidateFlag/1 (150 ms)
[----------] 2 tests from ContainerizerType/DefaultContainerDNSFlagTest (339 ms total)

[----------] Global test environment tear-down
[==========] 627 tests from 66 test cases ran. (335899 ms total)
[  PASSED  ] 626 tests.
[  FAILED  ] 1 test, listed below:
[  FAILED  ] ContentType/MasterAPITest.EventAuthorizationFiltering/1, where GetParam() = application/json

 1 FAILED TEST
  YOU HAVE 174 DISABLED TESTS

```

- [mesos-tests-stderr.log](http://dcos-win.westus.cloudapp.azure.com/mesos-build/review/62214/logs/mesos-tests-stderr.log):

```
I0914 21:39:25.307788 16848 master.cpp:8418] Removing framework 67e1c6b1-a376-4f26-bddb-0405647f4e4e-0000
(default)
I0914 21:39:25.307788 16848 master.cpp:3267] Deactivating framework 67e1c6b1-a376-4f26-bddb-0405647f4e4e-0000
(default)
I0914 21:39:25.308787 17072 hierarchical.cpp:412] Deactivated framework 67e1c6b1-a376-4f26-bddb-0405647f4e4e-0000
I0914 21:39:25.308787 13984 slave.cpp:3235] Shutting down framework 67e1c6b1-a376-4f26-bddb-0405647f4e4e-0000
I0914 21:39:25.308787 16848 master.cpp:8993] Updating the state of task d8848512-704e-4b0c-bfa1-14a7593cd0c5
of framework 67e1c6b1-a376-4f26-bddb-0405647f4e4e-0000 (latest state: TASK_KILLED, status
update state: TASK_KILLED)
I0914 21:39:25.308787 13984 slave.cpp:5731] Shutting down executor 'default' of framework
67e1c6b1-a376-4f26-bddb-0405647f4e4e-0000 (via HTTP)
I0914 21:39:25.326788 16848 master.cpp:9087] Removing task d8848512-704e-4b0c-bfa1-14a7593cd0c5
with resources [{"allocation_info":{"role":"*"},"name":"cpus","scalar":{"value":2.0},"type":"SCALAR"},{"allocation_info":{"role":"*"},"name":"mem","scalar":{"value":1024.0},"type":"SCALAR"},{"allocation_info":{"role":"*"},"name":"disk","scalar":{"value":1024.0},"type":"SCALAR"},{"allocation_info":{"role":"*"},"name":"ports","ranges":{"range":[{"begin":31000,"end":32000}]},"type":"RANGES"}]
of framework 67e1c6b1-a376-4f26-bddb-0405647f4e4e-0000 on agent 67e1c6b1-a376-4f26-bddb-0405647f4e4e-S0
at slave(254)@10.3.1.5:57393 (mesos-bld-s1.zq4gs31qjdiunm1ryi1452nvnh.dx.internal.cloudapp.net)
I0914 21:39:25.337790 16848 master.cpp:9116] Removing executor 'default' with resources []
of framework 67e1c6b1-a376-4f26-bddb-0405647f4e4e-0000 on agent 67e1c6b1-a376-4f26-bddb-0405647f4e4e-S0
at slave(254)@10.3.1.5:57393 (mesos-bld-s1.zq4gs31qjdiunm1ryi1452nvnh.dx.internal.cloudapp.net)
I0914 21:39:25.351790 17072 hierarchical.cpp:355] Removed framework 67e1c6b1-a376-4f26-bddb-0405647f4e4e-0000
E0914 21:39:25.352789 13984 scheduler.cpp:649] End-Of-File received from master. The master
closed the event stream
I0914 21:39:25.354790 17072 scheduler.cpp:444] Re-detecting master
I0914 21:39:25.356791 17072 scheduler.cpp:470] New master detected at master@10.3.1.5:57393
I0914 21:39:25.373792 15500 slave.cpp:5407] Executor 'default' of framework 67e1c6b1-a376-4f26-bddb-0405647f4e4e-0000
exited with status 0
I0914 21:39:25.373792 15500 slave.cpp:5511] Cleaning up executor 'default' of framework 67e1c6b1-a376-4f26-bddb-0405647f4e4e-0000
(via HTTP)
W0914 21:39:25.374792 16848 master.cpp:7021] Ignoring unknown exited executor 'default' of
framework 67e1c6b1-a376-4f26-bddb-0405647f4e4e-0000 on agent 67e1c6b1-a376-4f26-bddb-0405647f4e4e-S0
at slave(254)@10.3.1.5:57393 (mesos-bld-s1.zq4gs31qjdiunm1ryi1452nvnh.dx.internal.cloudapp.net)
I0914 21:39:25.375792 11680 gc.cpp:91] Scheduling 'C:\Users\mesos\AppData\Local\Temp\2\iJAP5n\slaves\67e1c6b1-a376-4f26-bddb-0405647f4e4e-S0\frameworks\67e1c6b1-a376-4f26-bddb-0405647f4e4e-0000\executors\default\runs\be8500ef-854a-4694-8439-7ab5e41a4c29'
for gc 6.99999565054519days in the future
I0914 21:39:25.377837 15500 slave.cpp:5607] Cleaning up framework 67e1c6b1-a376-4f26-bddb-0405647f4e4e-0000
I0914 21:39:25.394234 17372 status_update_manager.cpp:285] Closing status update streams for
framework 67e1c6b1-a376-4f26-bddb-0405647f4e4e-0000
I0914 21:39:25.395232 11680 gc.cpp:91] Scheduling 'C:\Users\mesos\AppData\Local\Temp\2\iJAP5n\slaves\67e1c6b1-a376-4f26-bddb-0405647f4e4e-S0\frameworks\67e1c6b1-a376-4f26-bddb-0405647f4e4e-0000\executors\default'
for gc 6.99999563898074days in the future
I0914 21:39:25.395232 11680 gc.cpp:91] Scheduling 'C:\Users\mesos\AppData\Local\Temp\2\iJAP5n\slaves\67e1c6b1-a376-4f26-bddb-0405647f4e4e-S0\frameworks\67e1c6b1-a376-4f26-bddb-0405647f4e4e-0000'
for gc 6.9999954255437days in the future
I0914 21:39:25.396232 15500 slave.cpp:861] Agent terminating
I0914 21:39:25.406476 13984 master.cpp:1321] Agent 67e1c6b1-a376-4f26-bddb-0405647f4e4e-S0
at slave(254)@10.3.1.5:57393 (mesos-bld-s1.zq4gs31qjdiunm1ryi1452nvnh.dx.internal.cloudapp.net)
disconnected
I0914 21:39:25.407485 13984 master.cpp:3304] Disconnecting agent 67e1c6b1-a376-4f26-bddb-0405647f4e4e-S0
at slave(254)@10.3.1.5:57393 (mesos-bld-s1.zq4gs31qjdiunm1ryi1452nvnh.dx.internal.cloudapp.net)
I0914 21:39:25.407485 13984 master.cpp:3323] Deactivating agent 67e1c6b1-a376-4f26-bddb-0405647f4e4e-S0
at slave(254)@10.3.1.5:57393 (mesos-bld-s1.zq4gs31qjdiunm1ryi1452nvnh.dx.internal.cloudapp.net)
I0914 21:39:25.408483 17024 hierarchical.cpp:690] Agent 67e1c6b1-a376-4f26-bddb-0405647f4e4e-S0
deactivated
I0914 21:39:25.436491 17156 master.cpp:1163] Master terminating
I0914 21:39:25.450485 13984 hierarchical.cpp:626] Removed agent 67e1c6b1-a376-4f26-bddb-0405647f4e4e-S0
W0914 21:39:25.450485 17156 master.hpp:2761] Failed to close HTTP pipe for 67e1c6b1-a376-4f26-bddb-0405647f4e4e-0000
(default)
I0914 21:39:26.133702 16492 process.cpp:1068] Failed to accept socket: future discarded
```

- Mesos Reviewbot Windows


On Sept. 14, 2017, 3:59 p.m., Armand Grillet wrote:
> 
> -----------------------------------------------------------
> This is an automatically generated e-mail. To reply, visit:
> https://reviews.apache.org/r/62214/
> -----------------------------------------------------------
> 
> (Updated Sept. 14, 2017, 3:59 p.m.)
> 
> 
> Review request for mesos, Benjamin Mahler and Kevin Klues.
> 
> 
> Bugs: MESOS-7924
>     https://issues.apache.org/jira/browse/MESOS-7924
> 
> 
> Repository: mesos
> 
> 
> Description
> -------
> 
> This linter runs when changes on a JavaScript file are being committed.
> The linter used is ESLint with a configuration based on our current JS
> code base. The linter and its dependencies (i.e. Node.js) are installed
> in a environment using Virtualenv and then Nodeenv.
> 
> 
> Diffs
> -----
> 
>   src/webui/.eslintrc.js PRE-CREATION 
>   src/webui/.gitignore PRE-CREATION 
>   src/webui/bootstrap PRE-CREATION 
>   src/webui/pip-requirements.txt PRE-CREATION 
>   support/mesos-style.py cf37d9f4da4ab90b92f0136a1dcd5dd8bbae5785 
> 
> 
> Diff: https://reviews.apache.org/r/62214/diff/2/
> 
> 
> Testing
> -------
> 
> Following this commit, I have tried to commit a change on a JavaScript file and checked
that ESLinter was correctly running.
> 
> 
> Thanks,
> 
> Armand Grillet
> 
>


Mime
  • Unnamed multipart/alternative (inline, None, 0 bytes)
View raw message