mesos-reviews mailing list archives

Site index · List index
Message view « Date » · « Thread »
Top « Date » · « Thread »
From Mesos Reviewbot Windows <revi...@mesos.apache.org>
Subject Re: Review Request 62279: Fixed failure of `DefaultExecutorTest.SigkillExecutor` test on windows.
Date Wed, 13 Sep 2017 16:48:06 GMT

-----------------------------------------------------------
This is an automatically generated e-mail. To reply, visit:
https://reviews.apache.org/r/62279/#review185306
-----------------------------------------------------------



FAIL: Some Mesos tests failed.

Reviews applied: `['62279']`

Failed command: `C:\mesos\src\mesos-tests.exe --verbose`

All the build artifacts available at: http://dcos-win.westus.cloudapp.azure.com/mesos-build/review/62279

Relevant logs:

- [mesos-tests-stdout.log](http://dcos-win.westus.cloudapp.azure.com/mesos-build/review/62279/logs/mesos-tests-stdout.log):

```
[ RUN      ] ContentType/SchedulerTest.SchedulerReconnect/0
[       OK ] ContentType/SchedulerTest.SchedulerReconnect/0 (237 ms)
[ RUN      ] ContentType/SchedulerTest.SchedulerReconnect/1
[       OK ] ContentType/SchedulerTest.SchedulerReconnect/1 (228 ms)
[----------] 30 tests from ContentType/SchedulerTest (25341 ms total)

[----------] 2 tests from ContentTypeAndSSLConfig/SchedulerSSLTest
[ RUN      ] ContentTypeAndSSLConfig/SchedulerSSLTest.RunTaskAndTeardown/0
[       OK ] ContentTypeAndSSLConfig/SchedulerSSLTest.RunTaskAndTeardown/0 (943 ms)
[ RUN      ] ContentTypeAndSSLConfig/SchedulerSSLTest.RunTaskAndTeardown/1
[       OK ] ContentTypeAndSSLConfig/SchedulerSSLTest.RunTaskAndTeardown/1 (967 ms)
[----------] 2 tests from ContentTypeAndSSLConfig/SchedulerSSLTest (2005 ms total)

[----------] 2 tests from ContainerizerType/DefaultContainerDNSFlagTest
[ RUN      ] ContainerizerType/DefaultContainerDNSFlagTest.ValidateFlag/0
[       OK ] ContainerizerType/DefaultContainerDNSFlagTest.ValidateFlag/0 (142 ms)
[ RUN      ] ContainerizerType/DefaultContainerDNSFlagTest.ValidateFlag/1
[       OK ] ContainerizerType/DefaultContainerDNSFlagTest.ValidateFlag/1 (153 ms)
[----------] 2 tests from ContainerizerType/DefaultContainerDNSFlagTest (367 ms total)

[----------] Global test environment tear-down
[==========] 627 tests from 66 test cases ran. (354348 ms total)
[  PASSED  ] 626 tests.
[  FAILED  ] 1 test, listed below:
[  FAILED  ] ContentType/MasterAPITest.EventAuthorizationFiltering/1, where GetParam() = application/json

 1 FAILED TEST
  YOU HAVE 174 DISABLED TESTS

```

- [mesos-tests-stderr.log](http://dcos-win.westus.cloudapp.azure.com/mesos-build/review/62279/logs/mesos-tests-stderr.log):

```
I0913 16:47:16.687176 14904 master.cpp:8418] Removing framework 1a69d5a5-49b5-4f9e-9d24-48ea047a414a-0000
(default)
I0913 16:47:16.687176 14904 master.cpp:3267] Deactivating framework 1a69d5a5-49b5-4f9e-9d24-48ea047a414a-0000
(default)
I0913 16:47:16.688171  9376 hierarchical.cpp:412] Deactivated framework 1a69d5a5-49b5-4f9e-9d24-48ea047a414a-0000
I0913 16:47:16.688171 13648 slave.cpp:3235] Shutting down framework 1a69d5a5-49b5-4f9e-9d24-48ea047a414a-0000
I0913 16:47:16.688171 14904 master.cpp:8993] Updating the state of task b7d108cf-9966-418e-8d2f-72106efcd3c3
of framework 1a69d5a5-49b5-4f9e-9d24-48ea047a414a-0000 (latest state: TASK_KILLED, status
update state: TASK_KILLED)
I0913 16:47:16.698185 13648 slave.cpp:5731] Shutting down executor 'default' of framework
1a69d5a5-49b5-4f9e-9d24-48ea047a414a-0000 (via HTTP)
I0913 16:47:16.702172 14904 master.cpp:9087] Removing task b7d108cf-9966-418e-8d2f-72106efcd3c3
with resources [{"allocation_info":{"role":"*"},"name":"cpus","scalar":{"value":2.0},"type":"SCALAR"},{"allocation_info":{"role":"*"},"name":"mem","scalar":{"value":1024.0},"type":"SCALAR"},{"allocation_info":{"role":"*"},"name":"disk","scalar":{"value":1024.0},"type":"SCALAR"},{"allocation_info":{"role":"*"},"name":"ports","ranges":{"range":[{"begin":31000,"end":32000}]},"type":"RANGES"}]
of framework 1a69d5a5-49b5-4f9e-9d24-48ea047a414a-0000 on agent 1a69d5a5-49b5-4f9e-9d24-48ea047a414a-S0
at slave(254)@10.3.1.5:51572 (mesos-bld-s1.zq4gs31qjdiunm1ryi1452nvnh.dx.internal.cloudapp.net)
I0913 16:47:16.722234 14904 master.cpp:9116] Removing executor 'default' with resources []
of framework 1a69d5a5-49b5-4f9e-9d24-48ea047a414a-0000 on agent 1a69d5a5-49b5-4f9e-9d24-48ea047a414a-S0
at slave(254)@10.3.1.5:51572 (mesos-bld-s1.zq4gs31qjdiunm1ryi1452nvnh.dx.internal.cloudapp.net)
I0913 16:47:16.726174  9376 hierarchical.cpp:355] Removed framework 1a69d5a5-49b5-4f9e-9d24-48ea047a414a-0000
E0913 16:47:16.726174 14148 scheduler.cpp:649] End-Of-File received from master. The master
closed the event stream
I0913 16:47:16.728173 10748 scheduler.cpp:444] Re-detecting master
I0913 16:47:16.731173 14904 scheduler.cpp:470] New master detected at master@10.3.1.5:51572
I0913 16:47:16.743175 15300 slave.cpp:5407] Executor 'default' of framework 1a69d5a5-49b5-4f9e-9d24-48ea047a414a-0000
exited with status 0
I0913 16:47:16.743175 15300 slave.cpp:5511] Cleaning up executor 'default' of framework 1a69d5a5-49b5-4f9e-9d24-48ea047a414a-0000
(via HTTP)
W0913 16:47:16.743175 10748 master.cpp:7021] Ignoring unknown exited executor 'default' of
framework 1a69d5a5-49b5-4f9e-9d24-48ea047a414a-0000 on agent 1a69d5a5-49b5-4f9e-9d24-48ea047a414a-S0
at slave(254)@10.3.1.5:51572 (mesos-bld-s1.zq4gs31qjdiunm1ryi1452nvnh.dx.internal.cloudapp.net)
I0913 16:47:16.748204 14936 gc.cpp:91] Scheduling 'C:\Users\mesos\AppData\Local\Temp\2\YYGmNQ\slaves\1a69d5a5-49b5-4f9e-9d24-48ea047a414a-S0\frameworks\1a69d5a5-49b5-4f9e-9d24-48ea047a414a-0000\executors\default\runs\44a60ef9-a681-44c1-ad91-99c77b908b44'
for gc 6.99999139843852days in the future
I0913 16:47:16.750174 15300 slave.cpp:5607] Cleaning up framework 1a69d5a5-49b5-4f9e-9d24-48ea047a414a-0000
I0913 16:47:16.754174 14148 status_update_manager.cpp:285] Closing status update streams for
framework 1a69d5a5-49b5-4f9e-9d24-48ea047a414a-0000
I0913 16:47:16.754174 14936 gc.cpp:91] Scheduling 'C:\Users\mesos\AppData\Local\Temp\2\YYGmNQ\slaves\1a69d5a5-49b5-4f9e-9d24-48ea047a414a-S0\frameworks\1a69d5a5-49b5-4f9e-9d24-48ea047a414a-0000\executors\default'
for gc 6.99999131741926days in the future
I0913 16:47:16.754174 15300 slave.cpp:861] Agent terminating
I0913 16:47:16.762181 14936 gc.cpp:91] Scheduling 'C:\Users\mesos\AppData\Local\Temp\2\YYGmNQ\slaves\1a69d5a5-49b5-4f9e-9d24-48ea047a414a-S0\frameworks\1a69d5a5-49b5-4f9e-9d24-48ea047a414a-0000'
for gc 6.99999127112296days in the future
I0913 16:47:16.762181  8652 master.cpp:1321] Agent 1a69d5a5-49b5-4f9e-9d24-48ea047a414a-S0
at slave(254)@10.3.1.5:51572 (mesos-bld-s1.zq4gs31qjdiunm1ryi1452nvnh.dx.internal.cloudapp.net)
disconnected
I0913 16:47:16.763173  8652 master.cpp:3304] Disconnecting agent 1a69d5a5-49b5-4f9e-9d24-48ea047a414a-S0
at slave(254)@10.3.1.5:51572 (mesos-bld-s1.zq4gs31qjdiunm1ryi1452nvnh.dx.internal.cloudapp.net)
I0913 16:47:16.763173  8652 master.cpp:3323] Deactivating agent 1a69d5a5-49b5-4f9e-9d24-48ea047a414a-S0
at slave(254)@10.3.1.5:51572 (mesos-bld-s1.zq4gs31qjdiunm1ryi1452nvnh.dx.internal.cloudapp.net)
I0913 16:47:16.764176 13648 hierarchical.cpp:690] Agent 1a69d5a5-49b5-4f9e-9d24-48ea047a414a-S0
deactivated
I0913 16:47:16.788274 11168 master.cpp:1163] Master terminating
I0913 16:47:16.792176  9376 hierarchical.cpp:626] Removed agent 1a69d5a5-49b5-4f9e-9d24-48ea047a414a-S0
W0913 16:47:16.800175 11168 master.hpp:2761] Failed to close HTTP pipe for 1a69d5a5-49b5-4f9e-9d24-48ea047a414a-0000
(default)
I0913 16:47:17.516232 15116 process.cpp:1068] Failed to accept socket: future discarded
```

- Mesos Reviewbot Windows


On Sept. 13, 2017, 12:03 p.m., Andrei Budnik wrote:
> 
> -----------------------------------------------------------
> This is an automatically generated e-mail. To reply, visit:
> https://reviews.apache.org/r/62279/
> -----------------------------------------------------------
> 
> (Updated Sept. 13, 2017, 12:03 p.m.)
> 
> 
> Review request for mesos, Alexander Rukletsov, Gastón Kleiman, Gilbert Song, and Qian
Zhang.
> 
> 
> Repository: mesos
> 
> 
> Description
> -------
> 
> Processes terminated by `os::killtree` exit normally with a status code
> on windows, but killed by a signal on linux. Previously, we expected
> a process to be killed by a signal, which causes test failure on
> windows. Since we don't care about exact value of a returned status
> code in this test, this check was removed.
> 
> 
> Diffs
> -----
> 
>   src/tests/default_executor_tests.cpp 186b8333c02ba3b9257e19437c6d689761085362 
> 
> 
> Diff: https://reviews.apache.org/r/62279/diff/2/
> 
> 
> Testing
> -------
> 
> internal CI
> 
> 
> Thanks,
> 
> Andrei Budnik
> 
>


Mime
  • Unnamed multipart/alternative (inline, None, 0 bytes)
View raw message