mesos-reviews mailing list archives

Site index · List index
Message view « Date » · « Thread »
Top « Date » · « Thread »
From Mesos Reviewbot Windows <revi...@mesos.apache.org>
Subject Re: Review Request 62279: Fixed failure of `DefaultExecutorTest.SigkillExecutor` test on windows.
Date Wed, 13 Sep 2017 14:14:46 GMT

-----------------------------------------------------------
This is an automatically generated e-mail. To reply, visit:
https://reviews.apache.org/r/62279/#review185293
-----------------------------------------------------------



FAIL: Some Mesos tests failed.

Reviews applied: `['62279']`

Failed command: `C:\mesos\src\mesos-tests.exe --verbose`

All the build artifacts available at: http://dcos-win.westus.cloudapp.azure.com/mesos-build/review/62279

Relevant logs:

- [mesos-tests-stdout.log](http://dcos-win.westus.cloudapp.azure.com/mesos-build/review/62279/logs/mesos-tests-stdout.log):

```
[ RUN      ] ContentType/SchedulerTest.SchedulerReconnect/0
[       OK ] ContentType/SchedulerTest.SchedulerReconnect/0 (263 ms)
[ RUN      ] ContentType/SchedulerTest.SchedulerReconnect/1
[       OK ] ContentType/SchedulerTest.SchedulerReconnect/1 (266 ms)
[----------] 30 tests from ContentType/SchedulerTest (25143 ms total)

[----------] 2 tests from ContentTypeAndSSLConfig/SchedulerSSLTest
[ RUN      ] ContentTypeAndSSLConfig/SchedulerSSLTest.RunTaskAndTeardown/0
[       OK ] ContentTypeAndSSLConfig/SchedulerSSLTest.RunTaskAndTeardown/0 (939 ms)
[ RUN      ] ContentTypeAndSSLConfig/SchedulerSSLTest.RunTaskAndTeardown/1
[       OK ] ContentTypeAndSSLConfig/SchedulerSSLTest.RunTaskAndTeardown/1 (1083 ms)
[----------] 2 tests from ContentTypeAndSSLConfig/SchedulerSSLTest (2108 ms total)

[----------] 2 tests from ContainerizerType/DefaultContainerDNSFlagTest
[ RUN      ] ContainerizerType/DefaultContainerDNSFlagTest.ValidateFlag/0
[       OK ] ContainerizerType/DefaultContainerDNSFlagTest.ValidateFlag/0 (137 ms)
[ RUN      ] ContainerizerType/DefaultContainerDNSFlagTest.ValidateFlag/1
[       OK ] ContainerizerType/DefaultContainerDNSFlagTest.ValidateFlag/1 (153 ms)
[----------] 2 tests from ContainerizerType/DefaultContainerDNSFlagTest (331 ms total)

[----------] Global test environment tear-down
[==========] 627 tests from 66 test cases ran. (340096 ms total)
[  PASSED  ] 626 tests.
[  FAILED  ] 1 test, listed below:
[  FAILED  ] ContentType/MasterAPITest.EventAuthorizationFiltering/1, where GetParam() = application/json

 1 FAILED TEST
  YOU HAVE 174 DISABLED TESTS

```

- [mesos-tests-stderr.log](http://dcos-win.westus.cloudapp.azure.com/mesos-build/review/62279/logs/mesos-tests-stderr.log):

```
I0913 14:14:05.771536 12776 master.cpp:8418] Removing framework 9b811a3c-0f19-47ec-89f7-5dabbe09b989-0000
(default)
I0913 14:14:05.771536 12776 master.cpp:3267] Deactivating framework 9b811a3c-0f19-47ec-89f7-5dabbe09b989-0000
(default)
I0913 14:14:05.772536 12440 hierarchical.cpp:412] Deactivated framework 9b811a3c-0f19-47ec-89f7-5dabbe09b989-0000
I0913 14:14:05.772536 13824 slave.cpp:3235] Shutting down framework 9b811a3c-0f19-47ec-89f7-5dabbe09b989-0000
I0913 14:14:05.772536 12776 master.cpp:8993] Updating the state of task cfceaa94-9706-4731-9e4b-cac83e493616
of framework 9b811a3c-0f19-47ec-89f7-5dabbe09b989-0000 (latest state: TASK_KILLED, status
update state: TASK_KILLED)
I0913 14:14:05.772536 13824 slave.cpp:5731] Shutting down executor 'default' of framework
9b811a3c-0f19-47ec-89f7-5dabbe09b989-0000 (via HTTP)
I0913 14:14:05.790535 12776 master.cpp:9087] Removing task cfceaa94-9706-4731-9e4b-cac83e493616
with resources [{"allocation_info":{"role":"*"},"name":"cpus","scalar":{"value":2.0},"type":"SCALAR"},{"allocation_info":{"role":"*"},"name":"mem","scalar":{"value":1024.0},"type":"SCALAR"},{"allocation_info":{"role":"*"},"name":"disk","scalar":{"value":1024.0},"type":"SCALAR"},{"allocation_info":{"role":"*"},"name":"ports","ranges":{"range":[{"begin":31000,"end":32000}]},"type":"RANGES"}]
of framework 9b811a3c-0f19-47ec-89f7-5dabbe09b989-0000 on agent 9b811a3c-0f19-47ec-89f7-5dabbe09b989-S0
at slave(254)@10.3.1.5:50507 (mesos-bld-s1.zq4gs31qjdiunm1ryi1452nvnh.dx.internal.cloudapp.net)
I0913 14:14:05.805546 12776 master.cpp:9116] Removing executor 'default' with resources []
of framework 9b811a3c-0f19-47ec-89f7-5dabbe09b989-0000 on agent 9b811a3c-0f19-47ec-89f7-5dabbe09b989-S0
at slave(254)@10.3.1.5:50507 (mesos-bld-s1.zq4gs31qjdiunm1ryi1452nvnh.dx.internal.cloudapp.net)
I0913 14:14:05.817531 11872 hierarchical.cpp:355] Removed framework 9b811a3c-0f19-47ec-89f7-5dabbe09b989-0000
E0913 14:14:05.817531 13484 scheduler.cpp:649] End-Of-File received from master. The master
closed the event stream
I0913 14:14:05.819530 12440 scheduler.cpp:444] Re-detecting master
I0913 14:14:05.822530 12440 scheduler.cpp:470] New master detected at master@10.3.1.5:50507
I0913 14:14:05.833529 12440 slave.cpp:5407] Executor 'default' of framework 9b811a3c-0f19-47ec-89f7-5dabbe09b989-0000
exited with status 0
I0913 14:14:05.834529 12440 slave.cpp:5511] Cleaning up executor 'default' of framework 9b811a3c-0f19-47ec-89f7-5dabbe09b989-0000
(via HTTP)
W0913 14:14:05.839529 13824 master.cpp:7021] Ignoring unknown exited executor 'default' of
framework 9b811a3c-0f19-47ec-89f7-5dabbe09b989-0000 on agent 9b811a3c-0f19-47ec-89f7-5dabbe09b989-S0
at slave(254)@10.3.1.5:50507 (mesos-bld-s1.zq4gs31qjdiunm1ryi1452nvnh.dx.internal.cloudapp.net)
I0913 14:14:05.839529 12776 gc.cpp:91] Scheduling 'C:\Users\mesos\AppData\Local\Temp\2\WjJFuC\slaves\9b811a3c-0f19-47ec-89f7-5dabbe09b989-S0\frameworks\9b811a3c-0f19-47ec-89f7-5dabbe09b989-0000\executors\default\runs\03184a0c-1471-47f0-92b5-3ef4098a40a6'
for gc 6.99999028321778days in the future
I0913 14:14:05.841528 12440 slave.cpp:5607] Cleaning up framework 9b811a3c-0f19-47ec-89f7-5dabbe09b989-0000
I0913 14:14:05.848533 13156 status_update_manager.cpp:285] Closing status update streams for
framework 9b811a3c-0f19-47ec-89f7-5dabbe09b989-0000
I0913 14:14:05.848533 12776 gc.cpp:91] Scheduling 'C:\Users\mesos\AppData\Local\Temp\2\WjJFuC\slaves\9b811a3c-0f19-47ec-89f7-5dabbe09b989-S0\frameworks\9b811a3c-0f19-47ec-89f7-5dabbe09b989-0000\executors\default'
for gc 6.99999026008days in the future
I0913 14:14:05.849529 12440 slave.cpp:861] Agent terminating
I0913 14:14:05.849529 12776 gc.cpp:91] Scheduling 'C:\Users\mesos\AppData\Local\Temp\2\WjJFuC\slaves\9b811a3c-0f19-47ec-89f7-5dabbe09b989-S0\frameworks\9b811a3c-0f19-47ec-89f7-5dabbe09b989-0000'
for gc 6.99999016748741days in the future
I0913 14:14:05.857561 13484 master.cpp:1321] Agent 9b811a3c-0f19-47ec-89f7-5dabbe09b989-S0
at slave(254)@10.3.1.5:50507 (mesos-bld-s1.zq4gs31qjdiunm1ryi1452nvnh.dx.internal.cloudapp.net)
disconnected
I0913 14:14:05.858526 13484 master.cpp:3304] Disconnecting agent 9b811a3c-0f19-47ec-89f7-5dabbe09b989-S0
at slave(254)@10.3.1.5:50507 (mesos-bld-s1.zq4gs31qjdiunm1ryi1452nvnh.dx.internal.cloudapp.net)
I0913 14:14:05.858526 13484 master.cpp:3323] Deactivating agent 9b811a3c-0f19-47ec-89f7-5dabbe09b989-S0
at slave(254)@10.3.1.5:50507 (mesos-bld-s1.zq4gs31qjdiunm1ryi1452nvnh.dx.internal.cloudapp.net)
I0913 14:14:05.859526 11872 hierarchical.cpp:690] Agent 9b811a3c-0f19-47ec-89f7-5dabbe09b989-S0
deactivated
I0913 14:14:05.892521 13152 master.cpp:1163] Master terminating
I0913 14:14:05.901521 11872 hierarchical.cpp:626] Removed agent 9b811a3c-0f19-47ec-89f7-5dabbe09b989-S0
W0913 14:14:05.908520 13152 master.hpp:2761] Failed to close HTTP pipe for 9b811a3c-0f19-47ec-89f7-5dabbe09b989-0000
(default)
I0913 14:14:06.614440 14284 process.cpp:1068] Failed to accept socket: future discarded
```

- Mesos Reviewbot Windows


On Sept. 13, 2017, 12:03 p.m., Andrei Budnik wrote:
> 
> -----------------------------------------------------------
> This is an automatically generated e-mail. To reply, visit:
> https://reviews.apache.org/r/62279/
> -----------------------------------------------------------
> 
> (Updated Sept. 13, 2017, 12:03 p.m.)
> 
> 
> Review request for mesos, Alexander Rukletsov, Gastón Kleiman, Gilbert Song, and Qian
Zhang.
> 
> 
> Repository: mesos
> 
> 
> Description
> -------
> 
> Processes terminated by `os::killtree` exit normally with status code
> on windows. This patch fixes expected status code of a killed task.
> 
> 
> Diffs
> -----
> 
>   src/tests/default_executor_tests.cpp 186b8333c02ba3b9257e19437c6d689761085362 
> 
> 
> Diff: https://reviews.apache.org/r/62279/diff/1/
> 
> 
> Testing
> -------
> 
> internal CI
> 
> 
> Thanks,
> 
> Andrei Budnik
> 
>


Mime
  • Unnamed multipart/alternative (inline, None, 0 bytes)
View raw message