mesos-reviews mailing list archives

Site index · List index
Message view « Date » · « Thread »
Top « Date » · « Thread »
From Mesos Reviewbot Windows <revi...@mesos.apache.org>
Subject Re: Review Request 62246: Added workaround for a docker bug in docker build helper.
Date Wed, 13 Sep 2017 03:40:42 GMT

-----------------------------------------------------------
This is an automatically generated e-mail. To reply, visit:
https://reviews.apache.org/r/62246/#review185259
-----------------------------------------------------------



FAIL: Some Mesos tests failed.

Reviews applied: `['62246']`

Failed command: `C:\mesos\src\mesos-tests.exe --verbose`

All the build artifacts available at: http://dcos-win.westus.cloudapp.azure.com/mesos-build/review/62246

Relevant logs:

- [mesos-tests-stdout.log](http://dcos-win.westus.cloudapp.azure.com/mesos-build/review/62246/logs/mesos-tests-stdout.log):

```

[----------] 2 tests from ContentTypeAndSSLConfig/SchedulerSSLTest
[ RUN      ] ContentTypeAndSSLConfig/SchedulerSSLTest.RunTaskAndTeardown/0
[       OK ] ContentTypeAndSSLConfig/SchedulerSSLTest.RunTaskAndTeardown/0 (890 ms)
[ RUN      ] ContentTypeAndSSLConfig/SchedulerSSLTest.RunTaskAndTeardown/1
[       OK ] ContentTypeAndSSLConfig/SchedulerSSLTest.RunTaskAndTeardown/1 (1017 ms)
[----------] 2 tests from ContentTypeAndSSLConfig/SchedulerSSLTest (2025 ms total)

[----------] 2 tests from ContainerizerType/DefaultContainerDNSFlagTest
[ RUN      ] ContainerizerType/DefaultContainerDNSFlagTest.ValidateFlag/0
[       OK ] ContainerizerType/DefaultContainerDNSFlagTest.ValidateFlag/0 (145 ms)
[ RUN      ] ContainerizerType/DefaultContainerDNSFlagTest.ValidateFlag/1
[       OK ] ContainerizerType/DefaultContainerDNSFlagTest.ValidateFlag/1 (161 ms)
[----------] 2 tests from ContainerizerType/DefaultContainerDNSFlagTest (347 ms total)

[----------] Global test environment tear-down
C:\mesos\mesos\src\tests\environment.cpp(756): error: Failed
Tests completed with child processes remaining:
-+- 10360 000000DEB5EFE47C
 --- 12976 000000DEB5EFE47C
[==========] 627 tests from 66 test cases ran. (334671 ms total)
[  PASSED  ] 625 tests.
[  FAILED  ] 2 tests, listed below:
[  FAILED  ] ContentType/MasterAPITest.EventAuthorizationFiltering/1, where GetParam() = application/json
[  FAILED  ] MesosContainerizer/DefaultExecutorTest.SigkillExecutor/0, where GetParam() =
"mesos"

 2 FAILED TESTS
  YOU HAVE 174 DISABLED TESTS

```

- [mesos-tests-stderr.log](http://dcos-win.westus.cloudapp.azure.com/mesos-build/review/62246/logs/mesos-tests-stderr.log):

```
I0913 03:40:09.330443 10836 master.cpp:8418] Removing framework 3541ce17-6339-4cd6-b93d-afd3e7da6b7f-0000
(default)
I0913 03:40:09.330443 10836 master.cpp:3267] Deactivating framework 3541ce17-6339-4cd6-b93d-afd3e7da6b7f-0000
(default)
I0913 03:40:09.330443  3004 hierarchical.cpp:412] Deactivated framework 3541ce17-6339-4cd6-b93d-afd3e7da6b7f-0000
I0913 03:40:09.331439 10512 slave.cpp:3235] Shutting down framework 3541ce17-6339-4cd6-b93d-afd3e7da6b7f-0000
I0913 03:40:09.331439 10836 master.cpp:8993] Updating the state of task 1276933e-df6b-4126-b9d2-ab93a59f58f1
of framework 3541ce17-6339-4cd6-b93d-afd3e7da6b7f-0000 (latest state: TASK_KILLED, status
update state: TASK_KILLED)
I0913 03:40:09.331439 10512 slave.cpp:5731] Shutting down executor 'default' of framework
3541ce17-6339-4cd6-b93d-afd3e7da6b7f-0000 (via HTTP)
I0913 03:40:09.344758 10836 master.cpp:9087] Removing task 1276933e-df6b-4126-b9d2-ab93a59f58f1
with resources [{"allocation_info":{"role":"*"},"name":"cpus","scalar":{"value":2.0},"type":"SCALAR"},{"allocation_info":{"role":"*"},"name":"mem","scalar":{"value":1024.0},"type":"SCALAR"},{"allocation_info":{"role":"*"},"name":"disk","scalar":{"value":1024.0},"type":"SCALAR"},{"allocation_info":{"role":"*"},"name":"ports","ranges":{"range":[{"begin":31000,"end":32000}]},"type":"RANGES"}]
of framework 3541ce17-6339-4cd6-b93d-afd3e7da6b7f-0000 on agent 3541ce17-6339-4cd6-b93d-afd3e7da6b7f-S0
at slave(254)@10.3.1.5:64581 (mesos-bld-s1.zq4gs31qjdiunm1ryi1452nvnh.dx.internal.cloudapp.net)
I0913 03:40:09.355754 10836 master.cpp:9116] Removing executor 'default' with resources []
of framework 3541ce17-6339-4cd6-b93d-afd3e7da6b7f-0000 on agent 3541ce17-6339-4cd6-b93d-afd3e7da6b7f-S0
at slave(254)@10.3.1.5:64581 (mesos-bld-s1.zq4gs31qjdiunm1ryi1452nvnh.dx.internal.cloudapp.net)
I0913 03:40:09.368953  2780 hierarchical.cpp:355] Removed framework 3541ce17-6339-4cd6-b93d-afd3e7da6b7f-0000
E0913 03:40:09.368953  3004 scheduler.cpp:649] End-Of-File received from master. The master
closed the event stream
I0913 03:40:09.369956 12192 scheduler.cpp:444] Re-detecting master
I0913 03:40:09.373952 12192 scheduler.cpp:470] New master detected at master@10.3.1.5:64581
I0913 03:40:09.386953 12192 slave.cpp:5407] Executor 'default' of framework 3541ce17-6339-4cd6-b93d-afd3e7da6b7f-0000
exited with status 0
I0913 03:40:09.386953 12192 slave.cpp:5511] Cleaning up executor 'default' of framework 3541ce17-6339-4cd6-b93d-afd3e7da6b7f-0000
(via HTTP)
W0913 03:40:09.388953 12284 master.cpp:7021] Ignoring unknown exited executor 'default' of
framework 3541ce17-6339-4cd6-b93d-afd3e7da6b7f-0000 on agent 3541ce17-6339-4cd6-b93d-afd3e7da6b7f-S0
at slave(254)@10.3.1.5:64581 (mesos-bld-s1.zq4gs31qjdiunm1ryi1452nvnh.dx.internal.cloudapp.net)
I0913 03:40:09.388953 12308 gc.cpp:91] Scheduling 'C:\Users\mesos\AppData\Local\Temp\2\h0ymHM\slaves\3541ce17-6339-4cd6-b93d-afd3e7da6b7f-S0\frameworks\3541ce17-6339-4cd6-b93d-afd3e7da6b7f-0000\executors\default\runs\28d68bde-36c1-4f8e-bfc4-733fa740226b'
for gc 6.9999954982163days in the future
I0913 03:40:09.393951 12192 slave.cpp:5607] Cleaning up framework 3541ce17-6339-4cd6-b93d-afd3e7da6b7f-0000
I0913 03:40:09.415396 10512 status_update_manager.cpp:285] Closing status update streams for
framework 3541ce17-6339-4cd6-b93d-afd3e7da6b7f-0000
I0913 03:40:09.416391 12308 gc.cpp:91] Scheduling 'C:\Users\mesos\AppData\Local\Temp\2\h0ymHM\slaves\3541ce17-6339-4cd6-b93d-afd3e7da6b7f-S0\frameworks\3541ce17-6339-4cd6-b93d-afd3e7da6b7f-0000\executors\default'
for gc 6.99999544037037days in the future
I0913 03:40:09.416391 12192 slave.cpp:861] Agent terminating
I0913 03:40:09.416391 12308 gc.cpp:91] Scheduling 'C:\Users\mesos\AppData\Local\Temp\2\h0ymHM\slaves\3541ce17-6339-4cd6-b93d-afd3e7da6b7f-S0\frameworks\3541ce17-6339-4cd6-b93d-afd3e7da6b7f-0000'
for gc 6.99999518064889days in the future
I0913 03:40:09.417392  3004 master.cpp:1321] Agent 3541ce17-6339-4cd6-b93d-afd3e7da6b7f-S0
at slave(254)@10.3.1.5:64581 (mesos-bld-s1.zq4gs31qjdiunm1ryi1452nvnh.dx.internal.cloudapp.net)
disconnected
I0913 03:40:09.427397  3004 master.cpp:3304] Disconnecting agent 3541ce17-6339-4cd6-b93d-afd3e7da6b7f-S0
at slave(254)@10.3.1.5:64581 (mesos-bld-s1.zq4gs31qjdiunm1ryi1452nvnh.dx.internal.cloudapp.net)
I0913 03:40:09.428514  3004 master.cpp:3323] Deactivating agent 3541ce17-6339-4cd6-b93d-afd3e7da6b7f-S0
at slave(254)@10.3.1.5:64581 (mesos-bld-s1.zq4gs31qjdiunm1ryi1452nvnh.dx.internal.cloudapp.net)
I0913 03:40:09.429392 12308 hierarchical.cpp:690] Agent 3541ce17-6339-4cd6-b93d-afd3e7da6b7f-S0
deactivated
I0913 03:40:09.449398  2780 master.cpp:1163] Master terminating
I0913 03:40:09.453392 10836 hierarchical.cpp:626] Removed agent 3541ce17-6339-4cd6-b93d-afd3e7da6b7f-S0
W0913 03:40:09.458392 12448 master.hpp:2761] Failed to close HTTP pipe for 3541ce17-6339-4cd6-b93d-afd3e7da6b7f-0000
(default)
I0913 03:40:10.179424  8624 process.cpp:1068] Failed to accept socket: future discarded
```

- Mesos Reviewbot Windows


On Sept. 12, 2017, 2:33 p.m., Andrei Budnik wrote:
> 
> -----------------------------------------------------------
> This is an automatically generated e-mail. To reply, visit:
> https://reviews.apache.org/r/62246/
> -----------------------------------------------------------
> 
> (Updated Sept. 12, 2017, 2:33 p.m.)
> 
> 
> Review request for mesos and Andrei Budnik.
> 
> 
> Repository: mesos
> 
> 
> Description
> -------
> 
> This patch adds workaround for an incorrect docker file execution on
> Apache CI due to a docker bug, see:
> https://github.com/moby/moby/issues/9547
> Quote from the docker issue:
> The execution of `chmod +x b.sh` just prior to trying to running b.sh
> is leaving it in the 'Text file busy' state for long enough that then
> running it fails.
> 
> 
> Diffs
> -----
> 
>   support/docker-build.sh 6443e56be8bf1421b29afef059196a838100b8af 
> 
> 
> Diff: https://reviews.apache.org/r/62246/diff/2/
> 
> 
> Testing
> -------
> 
> 
> Thanks,
> 
> Andrei Budnik
> 
>


Mime
  • Unnamed multipart/alternative (inline, None, 0 bytes)
View raw message