lucenenet-dev mailing list archives

Site index · List index
Message view « Date » · « Thread »
Top « Date » · « Thread »
From TeamCity at Codebetter ...@codebetter.com>
Subject [TeamCity, FAILED] Build Lucene.NET :: Lucene.NET Core [master] #685
Date Sun, 11 Sep 2016 22:03:44 GMT
Build Lucene.NET :: Lucene.NET Core [master] #685 failed (Tests failed: 13 (4 new), passed:
2488, ignored: 114).
Agent: JetBrains-dotnet-agent02
Build results: http://teamcity.codebetter.com/viewLog.html?buildId=227224&buildTypeId=LuceneNet_Core

Failed Tests Summary:
Newly failed tests (4 tests, alphabetically ordered)
==================================================================
Lucene.Net.Tests.dll: Lucene.Net.Analysis.TestGraphTokenizers.TestDoubleMockGraphTokenFilterRandom
Lucene.Net.Tests.dll: Lucene.Net.Analysis.TestGraphTokenizers.TestMockGraphTokenFilterBeforeHolesRandom
Lucene.Net.Tests.dll: Lucene.Net.Index.TestBagOfPositions.Test
Lucene.Net.Tests.dll: Lucene.Net.Index.TestIndexWriterReader.TestTooManySegments

Other failed tests (9 tests, alphabetically ordered)
==================================================================
Lucene.Net.Tests.dll: Lucene.Net.Codecs.Perfield.TestPerFieldPostingsFormat2.TestChangeCodecAndMerge
Lucene.Net.Tests.dll: Lucene.Net.Codecs.Perfield.TestPerFieldPostingsFormat2.TestMergeUnusedPerFieldCodec
Lucene.Net.Tests.dll: Lucene.Net.Codecs.Perfield.TestPerFieldPostingsFormat2.TestSameCodecDifferentInstance
Lucene.Net.Tests.dll: Lucene.Net.Codecs.Perfield.TestPerFieldPostingsFormat2.TestSameCodecDifferentParams
Lucene.Net.Tests.dll: Lucene.Net.Index.TestDuelingCodecs.TestEquals
Lucene.Net.Tests.dll: Lucene.Net.Index.TestIndexWriterWithThreads.TestOpenTwoIndexWritersOnDifferentThreads
Lucene.Net.Tests.dll: Lucene.Net.Index.TestNeverDelete.TestIndexing
Lucene.Net.Tests.dll: Lucene.Net.Index.TestNumericDocValuesUpdates.TestUpdateOldSegments
Lucene.Net.Tests.dll: Lucene.Net.Index.TestStressIndexing2.TestMultiConfig



Newly failed tests details (only first 3 failures shown here)
==================================================================
Lucene.Net.Tests.dll: Lucene.Net.Analysis.TestGraphTokenizers.TestDoubleMockGraphTokenFilterRandom
(new) =================
Test(s) failed. Test exceeded Timeout value of 20000ms

Lucene.Net.Tests.dll: Lucene.Net.Analysis.TestGraphTokenizers.TestMockGraphTokenFilterBeforeHolesRandom
(new) =================
Test(s) failed. Test exceeded Timeout value of 20000ms

Lucene.Net.Tests.dll: Lucene.Net.Index.TestBagOfPositions.Test (new) =================
Test(s) failed. Test exceeded Timeout value of 20000ms

see all newly failed tests: http://teamcity.codebetter.com/viewLog.html?buildId=227224&buildTypeId=LuceneNet_Core



Other failed tests details (only first 3 failures shown here)
==================================================================
Lucene.Net.Tests.dll: Lucene.Net.Codecs.Perfield.TestPerFieldPostingsFormat2.TestChangeCodecAndMerge
=================
Test(s) failed. System.IO.IOException : MockDirectoryWrapper: file "_0_MockSep_0.doc" is still
open for writing
  ----> System.Exception : unclosed IndexOutput: _0_MockSep_0.doc
   at Lucene.Net.Index.SegmentInfos.FindSegmentsFile.Run(IndexCommit commit) in z:\Builds\work\bcdbe6b8cc677a49\src\Lucene.Net.Core\Index\SegmentInfos.cs:line
1009
   at Lucene.Net.Index.StandardDirectoryReader.Open(Directory directory, IndexCommit commit,
Int32 termInfosIndexDivisor) in z:\Builds\work\bcdbe6b8cc677a49\src\Lucene.Net.Core\Index\StandardDirectoryReader.cs:line
53
   at Lucene.Net.Codecs.Perfield.TestPerFieldPostingsFormat2.AssertQuery(Term t, Directory
dir, Int32 num) in z:\Builds\work\bcdbe6b8cc677a49\src\Lucene.Net.Tests\core\Codecs\Perfield\TestPerFieldPostingsFormat2.cs:line
189
   at Lucene.Net.Codecs.Perfield.TestPerFieldPostingsFormat2.TestChangeCodecAndMerge() in
z:\Builds\work\bcdbe6b8cc677a49\src\Lucene.Net.Tests\core\Codecs\Perfield\TestPerFieldPostingsFormat2.cs:line
128
--Exception

Lucene.Net.Tests.dll: Lucene.Net.Codecs.Perfield.TestPerFieldPostingsFormat2.TestMergeUnusedPerFieldCodec
=================
Test(s) failed. System.Exception : CheckIndex failed
   at Lucene.Net.Util.TestUtil.CheckIndex(Directory dir, Boolean crossCheckTermVectors) in
z:\Builds\work\bcdbe6b8cc677a49\src\Lucene.Net.TestFramework\Util\TestUtil.cs:line 162
   at Lucene.Net.Codecs.Perfield.TestPerFieldPostingsFormat2.TestMergeUnusedPerFieldCodec()
in z:\Builds\work\bcdbe6b8cc677a49\src\Lucene.Net.Tests\core\Codecs\Perfield\TestPerFieldPostingsFormat2.cs:line
100
------- Stderr: -------
CheckIndex failed
´╗┐Segments file=segments_3 numSegments=3 version=4.8 format=
  1 of 3: name=_0 docCount=10
    codec=Lucene46
    compound=False
    numFiles=13
    size (MB)=0.000946044921875
    diagnostics = System.Collections.Generic.Dictionary`2[System.String,System.String]
    no deletions
    test: open reader.........FAILED
    WARNING: fixIndex() would remove reference to this segment; full exception:
   at Lucene.Net.Store.MockDirectoryWrapper.OpenInput(String name, IOContext context) in z:\Builds\work\bcdbe6b8cc677a49\src\Lucene.Net.TestFramework\Store\MockDirectoryWrapper.cs:line
784
   at Lucene.Net.Codecs.MockSep.MockSingleIntIndexInput..ctor(Directory dir, String fileName,
IOContext context) in z:\Builds\work\bcdbe6b8cc677a49\src\Lucene.Net.TestFramework\Codecs\MockSep\MockSingleIntIndexInput.cs:line
37
   at Lucene.Net.Codecs.MockSep.MockSingleIntFactory.OpenInput(Directory dir, String fileName,
IOContext context) in z:\Builds\work\bcdbe6b8cc677a49\src\Lucene.Net.TestFramework\Codecs\MockSep\MockSingleIntFactory.cs:line
27
   at Lucene.Net.Codecs.Sep.SepPostingsReader..ctor(Directory dir, FieldInfos fieldInfos,
SegmentInfo segmentInfo, IOContext context, IntStreamFactory intFactory, String segmentSuffix)
in z:\Builds\work\bcdbe6b8cc677a49\src\Lucene.Net.Codecs\Sep\SepPostingsReader.cs:line 58
   at Lucene.Net.Codecs.MockSep.MockSepPostingsFormat.FieldsProducer(SegmentReadState state)
in z:\Builds\work\bcdbe6b8cc677a49\src\Lucene.Net.TestFramework\Codecs\MockSep\MockSepPostingsFormat.cs:line
84
   at Lucene.Net.Codecs.Perfield.PerFieldPostingsFormat.FieldsReader..ctor(PerFieldPostingsFormat
outerInstance, SegmentReadState readState) in z:\Builds\work\bcdbe6b8cc677a49\src\Lucene.Net.Core\Codecs\Perfield\PerFieldPostingsFormat.cs:line
216
   at Lucene.Net.Codecs.Perfield.PerFieldPostingsFormat.FieldsProducer(SegmentReadState state)
in z:\Builds\work\bcdbe6b8cc677a49\src\Lucene.Net.Core\Codecs\Perfield\PerFieldPostingsFormat.cs:line
277
   at Lucene.Net.Index.SegmentCoreReaders..ctor(SegmentReader owner, Directory dir, SegmentCommitInfo
si, IOContext context, Int32 termsIndexDivisor) in z:\Builds\work\bcdbe6b8cc677a49\src\Lucene.Net.Core\Index\SegmentCoreReaders.cs:line
151
   at Lucene.Net.Index.SegmentReader..ctor(SegmentCommitInfo si, Int32 termInfosIndexDivisor,
IOContext context) in z:\Builds\work\bcdbe6b8cc677a49\src\Lucene.Net.Core\Index\SegmentReader.cs:line
111
   at Lucene.Net.Index.CheckIndex.DoCheckIndex(IList`1 onlySegments) in z:\Builds\work\bcdbe6b8cc677a49\src\Lucene.Net.Core\Index\CheckIndex.cs:line
704
  2 of 3: name=_1 docCount=10
    codec=Lucene46
    compound=False
    numFiles=14
    size (MB)=0.00130844116210938
    diagnostics = System.Collections.Generic.Dictionary`2[System.String,System.String]
    no deletions
    test: open reader.........FAILED
    WARNING: fixIndex() would remove reference to this segment; full exception:
   at Lucene.Net.Store.MockDirectoryWrapper.OpenInput(String name, IOContext context) in z:\Builds\work\bcdbe6b8cc677a49\src\Lucene.Net.TestFramework\Store\MockDirectoryWrapper.cs:line
784
   at Lucene.Net.Codecs.MockSep.MockSingleIntIndexInput..ctor(Directory dir, String fileName,
IOContext context) in z:\Builds\work\bcdbe6b8cc677a49\src\Lucene.Net.TestFramework\Codecs\MockSep\MockSingleIntIndexInput.cs:line
37
   at Lucene.Net.Codecs.MockSep.MockSingleIntFactory.OpenInput(Directory dir, String fileName,
IOContext context) in z:\Builds\work\bcdbe6b8cc677a49\src\Lucene.Net.TestFramework\Codecs\MockSep\MockSingleIntFactory.cs:line
27
   at Lucene.Net.Codecs.Sep.SepPostingsReader..ctor(Directory dir, FieldInfos fieldInfos,
SegmentInfo segmentInfo, IOContext context, IntStreamFactory intFactory, String segmentSuffix)
in z:\Builds\work\bcdbe6b8cc677a49\src\Lucene.Net.Codecs\Sep\SepPostingsReader.cs:line 58
   at Lucene.Net.Codecs.MockSep.MockSepPostingsFormat.FieldsProducer(SegmentReadState state)
in z:\Builds\work\bcdbe6b8cc677a49\src\Lucene.Net.TestFramework\Codecs\MockSep\MockSepPostingsFormat.cs:line
84
   at Lucene.Net.Codecs.Perfield.PerFieldPostingsFormat.FieldsReader..ctor(PerFieldPostingsFormat
outerInstance, SegmentReadState readState) in z:\Builds\work\bcdbe6b8cc677a49\src\Lucene.Net.Core\Codecs\Perfield\PerFieldPostingsFormat.cs:line
216
   at Lucene.Net.Codecs.Perfield.PerFieldPostingsFormat.FieldsProducer(SegmentReadState state)
in z:\Builds\work\bcdbe6b8cc677a49\src\Lucene.Net.Core\Codecs\Perfield\PerFieldPostingsFormat.cs:line
277
   at Lucene.Net.Index.SegmentCoreReaders..ctor(SegmentReader owner, Directory dir, SegmentCommitInfo
si, IOContext context, Int32 termsIndexDivisor) in z:\Builds\work\bcdbe6b8cc677a49\src\Lucene.Net.Core\Index\SegmentCoreReaders.cs:line
151
   at Lucene.Net.Index.SegmentReader..ctor(SegmentCommitInfo si, Int32 termInfosIndexDivisor,
IOContext context) in z:\Builds\work\bcdbe6b8cc677a49\src\Lucene.Net.Core\Index\SegmentReader.cs:line
111
   at Lucene.Net.Index.CheckIndex.DoCheckIndex(IList`1 onlySegments) in z:\Builds\work\bcdbe6b8cc677a49\src\Lucene.Net.Core\Index\CheckIndex.cs:line
704
  3 of 3: name=_2 docCount=10
    codec=Lucene46
    compound=False
    numFiles=13
    size (MB)=0.000946044921875
    diagnostics = System.Collections.Generic.Dictionary`2[System.String,System.String]
    no deletions
    test: open reader.........FAILED
    WARNING: fixIndex() would remove reference to this segment; full exception:
   at Lucene.Net.Store.MockDirectoryWrapper.OpenInput(String name, IOContext context) in z:\Builds\work\bcdbe6b8cc677a49\src\Lucene.Net.TestFramework\Store\MockDirectoryWrapper.cs:line
784
   at Lucene.Net.Codecs.MockSep.MockSingleIntIndexInput..ctor(Directory dir, String fileName,
IOContext context) in z:\Builds\work\bcdbe6b8cc677a49\src\Lucene.Net.TestFramework\Codecs\MockSep\MockSingleIntIndexInput.cs:line
37
   at Lucene.Net.Codecs.MockSep.MockSingleIntFactory.OpenInput(Directory dir, String fileName,
IOContext context) in z:\Builds\work\bcdbe6b8cc677a49\src\Lucene.Net.TestFramework\Codecs\MockSep\MockSingleIntFactory.cs:line
27
   at Lucene.Net.Codecs.Sep.SepPostingsReader..ctor(Directory dir, FieldInfos fieldInfos,
SegmentInfo segmentInfo, IOContext context, IntStreamFactory intFactory, String segmentSuffix)
in z:\Builds\work\bcdbe6b8cc677a49\src\Lucene.Net.Codecs\Sep\SepPostingsReader.cs:line 58
   at Lucene.Net.Codecs.MockSep.MockSepPostingsFormat.FieldsProducer(SegmentReadState state)
in z:\Builds\work\bcdbe6b8cc677a49\src\Lucene.Net.TestFramework\Codecs\MockSep\MockSepPostingsFormat.cs:line
84
   at Lucene.Net.Codecs.Perfield.PerFieldPostingsFormat.FieldsReader..ctor(PerFieldPostingsFormat
outerInstance, SegmentReadState readState) in z:\Builds\work\bcdbe6b8cc677a49\src\Lucene.Net.Core\Codecs\Perfield\PerFieldPostingsFormat.cs:line
216
   at Lucene.Net.Codecs.Perfield.PerFieldPostingsFormat.FieldsProducer(SegmentReadState state)
in z:\Builds\work\bcdbe6b8cc677a49\src\Lucene.Net.Core\Codecs\Perfield\PerFieldPostingsFormat.cs:line
277
   at Lucene.Net.Index.SegmentCoreReaders..ctor(SegmentReader owner, Directory dir, SegmentCommitInfo
si, IOContext context, Int32 termsIndexDivisor) in z:\Builds\work\bcdbe6b8cc677a49\src\Lucene.Net.Core\Index\SegmentCoreReaders.cs:line
151
   at Lucene.Net.Index.SegmentReader..ctor(SegmentCommitInfo si, Int32 termInfosIndexDivisor,
IOContext context) in z:\Builds\work\bcdbe6b8cc677a49\src\Lucene.Net.Core\Index\SegmentReader.cs:line
111
   at Lucene.Net.Index.CheckIndex.DoCheckIndex(IList`1 onlySegments) in z:\Builds\work\bcdbe6b8cc677a49\src\Lucene.Net.Core\Index\CheckIndex.cs:line
704
WARNING: 3 broken segments (containing 30 documents) detected
Lucene.Net.Tests.dll: Lucene.Net.Codecs.Perfield.TestPerFieldPostingsFormat2.TestSameCodecDifferentInstance
=================
Test(s) failed. System.Exception : CheckIndex failed
   at Lucene.Net.Util.TestUtil.CheckIndex(Directory dir, Boolean crossCheckTermVectors) in
z:\Builds\work\bcdbe6b8cc677a49\src\Lucene.Net.TestFramework\Util\TestUtil.cs:line 162
   at Lucene.Net.Store.MockDirectoryWrapper.Dispose() in z:\Builds\work\bcdbe6b8cc677a49\src\Lucene.Net.TestFramework\Store\MockDirectoryWrapper.cs:line
943
   at Lucene.Net.Codecs.Perfield.TestPerFieldPostingsFormat2.DoTestMixedPostings(Codec codec)
in z:\Builds\work\bcdbe6b8cc677a49\src\Lucene.Net.Tests\core\Codecs\Perfield\TestPerFieldPostingsFormat2.cs:line
369
   at Lucene.Net.Codecs.Perfield.TestPerFieldPostingsFormat2.TestSameCodecDifferentInstance()
in z:\Builds\work\bcdbe6b8cc677a49\src\Lucene.Net.Tests\core\Codecs\Perfield\TestPerFieldPostingsFormat2.cs:line
284
------- Stderr: -------
CheckIndex failed
´╗┐Segments file=segments_1 numSegments=1 version=4.8 format=
  1 of 1: name=_0 docCount=100
    codec=Lucene46
    compound=False
    numFiles=18
    size (MB)=0.00341033935546875
    diagnostics = System.Collections.Generic.Dictionary`2[System.String,System.String]
    no deletions
    test: open reader.........OK
    test: check integrity.....OK
    test: check live docs.....OK
    test: fields..............OK [2 fields]
    test: field norms.........OK [2 fields]
    test: terms, freq, prox...ERROR: System.ArgumentException: Could not instantiate implementing
class for Lucene.Net.Codecs.Pulsing.PulsingPostingsReader+IPulsingEnumAttribute
   at Lucene.Net.Util.AttributeSource.AttributeFactory.DefaultAttributeFactory.CreateAttributeInstance[S]()
in z:\Builds\work\bcdbe6b8cc677a49\src\Lucene.Net.Core\Util\AttributeSource.cs:line 74
   at Lucene.Net.Util.AttributeSource.AddAttribute[T]() in z:\Builds\work\bcdbe6b8cc677a49\src\Lucene.Net.Core\Util\AttributeSource.cs:line
350
   at Lucene.Net.Codecs.Pulsing.PulsingPostingsReader.SetOther(DocsEnum de, DocsEnum other)
in z:\Builds\work\bcdbe6b8cc677a49\src\Lucene.Net.Codecs\Pulsing\PulsingPostingsReader.cs:line
290
   at Lucene.Net.Codecs.Pulsing.PulsingPostingsReader.Docs(FieldInfo field, BlockTermState
_termState, Bits liveDocs, DocsEnum reuse, Int32 flags) in z:\Builds\work\bcdbe6b8cc677a49\src\Lucene.Net.Codecs\Pulsing\PulsingPostingsReader.cs:line
184
   at Lucene.Net.Codecs.BlockTreeTermsReader.FieldReader.SegmentTermsEnum.Docs(Bits skipDocs,
DocsEnum reuse, Int32 flags) in z:\Builds\work\bcdbe6b8cc677a49\src\Lucene.Net.Core\Codecs\BlockTreeTermsReader.cs:line
2603
   at Lucene.Net.Index.CheckIndex.CheckFields(Fields fields, Bits liveDocs, Int32 maxDoc,
FieldInfos fieldInfos, Boolean doPrint, Boolean isVectors, StreamWriter infoStream, Boolean
verbose) in z:\Builds\work\bcdbe6b8cc677a49\src\Lucene.Net.Core\Index\CheckIndex.cs:line 1071
   at Lucene.Net.Index.CheckIndex.TestPostings(AtomicReader reader, StreamWriter infoStream,
Boolean verbose) in z:\Builds\work\bcdbe6b8cc677a49\src\Lucene.Net.Core\Index\CheckIndex.cs:line
1614
   at Lucene.Net.Util.AttributeSource.AttributeFactory.DefaultAttributeFactory.CreateAttributeInstance[S]()
in z:\Builds\work\bcdbe6b8cc677a49\src\Lucene.Net.Core\Util\AttributeSource.cs:line 74
   at Lucene.Net.Util.AttributeSource.AddAttribute[T]() in z:\Builds\work\bcdbe6b8cc677a49\src\Lucene.Net.Core\Util\AttributeSource.cs:line
350
   at Lucene.Net.Codecs.Pulsing.PulsingPostingsReader.SetOther(DocsEnum de, DocsEnum other)
in z:\Builds\work\bcdbe6b8cc677a49\src\Lucene.Net.Codecs\Pulsing\PulsingPostingsReader.cs:line
290
   at Lucene.Net.Codecs.Pulsing.PulsingPostingsReader.Docs(FieldInfo field, BlockTermState
_termState, Bits liveDocs, DocsEnum reuse, Int32 flags) in z:\Builds\work\bcdbe6b8cc677a49\src\Lucene.Net.Codecs\Pulsing\PulsingPostingsReader.cs:line
184
   at Lucene.Net.Codecs.BlockTreeTermsReader.FieldReader.SegmentTermsEnum.Docs(Bits skipDocs,
DocsEnum reuse, Int32 flags) in z:\Builds\work\bcdbe6b8cc677a49\src\Lucene.Net.Core\Codecs\BlockTreeTermsReader.cs:line
2603
   at Lucene.Net.Index.CheckIndex.CheckFields(Fields fields, Bits liveDocs, Int32 maxDoc,
FieldInfos fieldInfos, Boolean doPrint, Boolean isVectors, StreamWriter infoStream, Boolean
verbose) in z:\Builds\work\bcdbe6b8cc677a49\src\Lucene.Net.Core\Index\CheckIndex.cs:line 1071
   at Lucene.Net.Index.CheckIndex.TestPostings(AtomicReader reader, StreamWriter infoStream,
Boolean verbose) in z:\Builds\work\bcdbe6b8cc677a49\src\Lucene.Net.Core\Index\CheckIndex.cs:line
1614
    test: stored fields.......OK [0 total field count; avg 0 fields per doc]
    test: term vectors........ERROR [Could not instantiate implementing class for Lucene.Net.Codecs.Pulsing.PulsingPostingsReader+IPulsingEnumAttribute]
   at Lucene.Net.Util.AttributeSource.AttributeFactory.DefaultAttributeFactory.CreateAttributeInstance[S]()
in z:\Builds\work\bcdbe6b8cc677a49\src\Lucene.Net.Core\Util\AttributeSource.cs:line 74
   at Lucene.Net.Util.AttributeSource.AddAttribute[T]() in z:\Builds\work\bcdbe6b8cc677a49\src\Lucene.Net.Core\Util\AttributeSource.cs:line
350
   at Lucene.Net.Codecs.Pulsing.PulsingPostingsReader.GetOther(DocsEnum de) in z:\Builds\work\bcdbe6b8cc677a49\src\Lucene.Net.Codecs\Pulsing\PulsingPostingsReader.cs:line
281
   at Lucene.Net.Codecs.Pulsing.PulsingPostingsReader.DocsAndPositions(FieldInfo field, BlockTermState
_termState, Bits liveDocs, DocsAndPositionsEnum reuse, Int32 flags) in z:\Builds\work\bcdbe6b8cc677a49\src\Lucene.Net.Codecs\Pulsing\PulsingPostingsReader.cs:line
215
   at Lucene.Net.Codecs.BlockTreeTermsReader.FieldReader.SegmentTermsEnum.DocsAndPositions(Bits
skipDocs, DocsAndPositionsEnum reuse, Int32 flags) in z:\Builds\work\bcdbe6b8cc677a49\src\Lucene.Net.Core\Codecs\BlockTreeTermsReader.cs:line
2616
   at Lucene.Net.Index.CheckIndex.TestTermVectors(AtomicReader reader, StreamWriter infoStream,
Boolean verbose, Boolean crossCheckTermVectors) in z:\Builds\work\bcdbe6b8cc677a49\src\Lucene.Net.Core\Index\CheckIndex.cs:line
2104
    test: docvalues...........OK [0 docvalues fields; 0 BINARY; 0 NUMERIC; 0 SORTED; 0 SORTED_SET]
FAILED
    WARNING: fixIndex() would remove reference to this segment; full exception:
   at Lucene.Net.Index.CheckIndex.DoCheckIndex(IList`1 onlySegments) in z:\Builds\work\bcdbe6b8cc677a49\src\Lucene.Net.Core\Index\CheckIndex.cs:line
816
WARNING: 1 broken segments (containing 100 documents) detected
Changes included (56 changes, only 20 changes shown)
====================================================
Change 1946bf82cf7f9202f873617eebfed0913147faaf by itamar (0 file):
Merge remote-tracking branch '888/queryparser'


Change ab5c0595b64bdcaab41a604552f10dfa695e1f78 by shad (1 file):
Fixed merge conflict


Change 927b5a2aee55422b98806c6ef0191cc28654655e by shad (1 file):
Cleaned up QueryParser.Surround.Parser.QueryParser comments


Change bf635018b7eac84c3dd0ca94a76246eea673914e by shad (1 file):
Fixed string formatting bugs in QueryParser.Analyzing.AnalyzingQueryParser


Change 193c3489dea5daedaf7254668022c57813826c2a by shad (1 file):
Fixed bug in Classic.QueryParser caused by mistranslation from Java of break <label>
and continue <label>.


Change bd781797e28220ea00e9e149b8b6303b720ca980 by shad (1 file):
Fixed bug in Surround.QueryParser caused by mistranslation from Java of break <label>
and continue <label>.


Change 10dc873b1b5d5c1f54e1c0e41ea8b03380864e1a by shad (1 file):
Fixed RandomIndexWriter call because the overload that is supposed to be used was removed.


Change 2f07fa26b5be1f41c9b4353488c413a007e6274b by shad (3 files):
Moved the TestToStringUtils class to the Lucene.Net.Core.Support namespace.


Change 34284ee1ec18cc5ba76b2bc0a060b682de53f13c by shad (2 files):
Fixed ToStringUtils.Boost() for when the number to the left of the decimal is 0.


Change 66ab301f2916759160da9faf9eca0f5576b2968e by shad (3 files):
Fixed ugly string formatting in the ToStringUtils.Boost code that was carried over from Luene.Net
3.0.3. Added a test to ensure that the functionality is identical.


Change 57069313d04c2333106b7ed09d9e8db6de893b86 by shad (5 files):
Removed unnecessary usings.


Change 2efd9b4104fb9220d73e74b3042fd468ee637171 by shad (1 file):
Added missing documentation to SpanNearClauseFactory


Change 7b7b6348506b50734dad58fb0d2099904510a13b by shad (1 file):
Added missing guard clause to SimpleQueryParser.DefaultOperator.


Change 387d985b71edd4e7962a9fdbe6124d7cab3262f0 by shad (22 files):
Fixed accessibility of classes and members to match that of Java.


Change 679ad24cc41f0a91931edfca372b1ed688cbdee6 by shad (137 files):
Moved Lucene.Net.QueryParser and Lucene.Net.Tests.QueryParser projects into src\ directory.


Change 0f10c9f5424f579861f8bb86a241aab7de3f0821 by shad (2 files):
Updated comments.


Change 1e7576a6cc2ccf8277004519ee8971283f4c89dc by shad (36 files):
Ported QueryParser.Surround namespace + tests.


Change 6224f3e295c61defce4a5c6dfd5dd9458b030777 by shad (4 files):
Ported QueryParser.Simple namespace + tests.


Change e45f3289d5710bbcf3f9a4cbe995f31d05af9530 by shad (10 files):
Ported QueryParser.Ext namespace + tests.


Change 071b60ce871c174f356f65c1e6e96eb2f604b434 by shad (5 files):
Ported QueryParser.ComplexPhrase namespace + tests.


see more information about changed files: http://teamcity.codebetter.com/viewLog.html?tab=buildChangesDiv&buildId=227224&buildTypeId=LuceneNet_Core

============================================================================
Configure email notifications: http://teamcity.codebetter.com/profile.html?init=1&tab=userNotifications

Mime
  • Unnamed multipart/alternative (inline, None, 0 bytes)
View raw message