lucenenet-dev mailing list archives

Site index · List index
Message view « Date » · « Thread »
Top « Date » · « Thread »
From TeamCity at Codebetter ...@codebetter.com>
Subject [TeamCity, FAILED] Build Lucene.NET :: Lucene.NET Core [master] #672
Date Fri, 02 Sep 2016 09:15:20 GMT
Build Lucene.NET :: Lucene.NET Core [master] #672 failed (Tests failed: 14 (5 new), passed:
2488, ignored: 114).
Agent: JetBrains-dotnet-agent01
Build results: http://teamcity.codebetter.com/viewLog.html?buildId=226811&buildTypeId=LuceneNet_Core

Failed Tests Summary:
Newly failed tests (5 tests, alphabetically ordered)
==================================================================
Lucene.Net.Tests.dll: Lucene.Net.Index.TestNeverDelete.TestIndexing
Lucene.Net.Tests.dll: Lucene.Net.Index.TestNumericDocValuesUpdates.TestUpdateOldSegments
Lucene.Net.Tests.dll: Lucene.Net.Util.TestOfflineSorter.TestEmpty
Lucene.Net.Tests.dll: Lucene.Net.Util.TestOfflineSorter.TestIntermediateMerges
Lucene.Net.Tests.dll: Lucene.Net.Util.TestOfflineSorter.TestSmallRandom

Other failed tests (9 tests, alphabetically ordered)
==================================================================
Lucene.Net.Tests.dll: Lucene.Net.Codecs.Perfield.TestPerFieldPostingsFormat2.TestChangeCodecAndMerge
Lucene.Net.Tests.dll: Lucene.Net.Codecs.Perfield.TestPerFieldPostingsFormat2.TestMergeUnusedPerFieldCodec
Lucene.Net.Tests.dll: Lucene.Net.Codecs.Perfield.TestPerFieldPostingsFormat2.TestSameCodecDifferentInstance
Lucene.Net.Tests.dll: Lucene.Net.Codecs.Perfield.TestPerFieldPostingsFormat2.TestSameCodecDifferentParams
Lucene.Net.Tests.dll: Lucene.Net.Index.TestCrash.TestCrashAfterReopen(TaskMergeScheduler:
maxThreadCount=2147483647, maxMergeCount=2147483647)
Lucene.Net.Tests.dll: Lucene.Net.Index.TestDocTermOrds.TestRandom
Lucene.Net.Tests.dll: Lucene.Net.Index.TestDuelingCodecs.TestEquals
Lucene.Net.Tests.dll: Lucene.Net.Index.TestIndexWriterWithThreads.TestOpenTwoIndexWritersOnDifferentThreads
Lucene.Net.Tests.dll: Lucene.Net.Index.TestStressIndexing2.TestMultiConfig



Newly failed tests details (only first 3 failures shown here)
==================================================================
Lucene.Net.Tests.dll: Lucene.Net.Index.TestNeverDelete.TestIndexing (new) =================
Test(s) failed. System.ArgumentException : When specifying MemoryMappedFileAccess.Read access,
the capacity must not be larger than the file size.
   at System.IO.MemoryMappedFiles.MemoryMappedFile.CreateFromFile(FileStream fileStream, String
mapName, Int64 capacity, MemoryMappedFileAccess access, MemoryMappedFileSecurity memoryMappedFileSecurity,
HandleInheritability inheritability, Boolean leaveOpen)
   at Lucene.Net.Store.MMapDirectory.Map(MMapIndexInput input, FileStream fc, Int64 offset,
Int64 length) in z:\TeamCityAgent\work\bcdbe6b8cc677a49\src\Lucene.Net.Core\Store\MMapDirectory.cs:line
350
   at Lucene.Net.Store.MMapDirectory.MMapIndexInput..ctor(MMapDirectory outerInstance, String
resourceDescription, FileStream fc) in z:\TeamCityAgent\work\bcdbe6b8cc677a49\src\Lucene.Net.Core\Store\MMapDirectory.cs:line
257
   at Lucene.Net.Store.MMapDirectory.OpenInput(String name, IOContext context) in z:\TeamCityAgent\work\bcdbe6b8cc677a49\src\Lucene.Net.Core\Store\MMapDirectory.cs:line
205
   at Lucene.Net.Store.MockDirectoryWrapper.OpenInput(String name, IOContext context) in z:\TeamCityAgent\work\bcdbe6b8cc677a49\src\Lucene.Net.TestFramework\Store\MockDirectoryWrapper.cs:line
787
   at Lucene.Net.Store.FilterDirectory.OpenChecksumInput(String name, IOContext context) in
z:\TeamCityAgent\work\bcdbe6b8cc677a49\src\Lucene.Net.Core\Store\FilterDirectory.cs:line 132
   at Lucene.Net.Index.SegmentInfos.Read(Directory directory, String segmentFileName) in z:\TeamCityAgent\work\bcdbe6b8cc677a49\src\Lucene.Net.Core\Index\SegmentInfos.cs:line
360
   at Lucene.Net.Index.SegmentInfos.FindSegmentsFileAnonymousInnerClassHelper.DoBody(String
segmentFileName) in z:\TeamCityAgent\work\bcdbe6b8cc677a49\src\Lucene.Net.Core\Index\SegmentInfos.cs:line
487
   at Lucene.Net.Index.SegmentInfos.FindSegmentsFile.Run(IndexCommit commit) in z:\TeamCityAgent\work\bcdbe6b8cc677a49\src\Lucene.Net.Core\Index\SegmentInfos.cs:line
1031
   at Lucene.Net.Index.SegmentInfos.FindSegmentsFile.Run() in z:\TeamCityAgent\work\bcdbe6b8cc677a49\src\Lucene.Net.Core\Index\SegmentInfos.cs:line
838
   at Lucene.Net.Index.SegmentInfos.Read(Directory directory) in z:\TeamCityAgent\work\bcdbe6b8cc677a49\src\Lucene.Net.Core\Index\SegmentInfos.cs:line
469
   at Lucene.Net.Index.StandardDirectoryReader.get_Current() in z:\TeamCityAgent\work\bcdbe6b8cc677a49\src\Lucene.Net.Core\Index\StandardDirectoryReader.cs:line
453
   at Lucene.Net.Index.StandardDirectoryReader.DoOpenNoWriter(IndexCommit commit) in z:\TeamCityAgent\work\bcdbe6b8cc677a49\src\Lucene.Net.Core\Index\StandardDirectoryReader.cs:line
383
   at Lucene.Net.Index.StandardDirectoryReader.DoOpenIfChanged(IndexCommit commit) in z:\TeamCityAgent\work\bcdbe6b8cc677a49\src\Lucene.Net.Core\Index\StandardDirectoryReader.cs:line
332
   at Lucene.Net.Index.StandardDirectoryReader.DoOpenIfChanged() in z:\TeamCityAgent\work\bcdbe6b8cc677a49\src\Lucene.Net.Core\Index\StandardDirectoryReader.cs:line
323
   at Lucene.Net.Index.TestNeverDelete.TestIndexing() in z:\TeamCityAgent\work\bcdbe6b8cc677a49\src\Lucene.Net.Tests\core\Index\TestNeverDelete.cs:line
85
------- Stdout: -------
WARNING: Leftover undeleted temporary files The process cannot access the file 'write.lock'
because it is being used by another process.
------- Stderr: -------
Unhandled exception in remote appdomain: System.Exception: Could not find file 'Z:\TeamCityAgent\temp\buildTmp\LuceneTemp\TestNeverDelete-1\_p.fdx'.
---> System.IO.FileNotFoundException: Could not find file 'Z:\TeamCityAgent\temp\buildTmp\LuceneTemp\TestNeverDelete-1\_p.fdx'.
   at System.IO.__Error.WinIOError(Int32 errorCode, String maybeFullPath)
   at System.IO.FileInfo.get_Length()
   at Lucene.Net.Store.FSDirectory.FileLength(String name) in z:\TeamCityAgent\work\bcdbe6b8cc677a49\src\Lucene.Net.Core\Store\FSDirectory.cs:line
301
   at Lucene.Net.Store.MockDirectoryWrapper.FileLength(String name) in z:\TeamCityAgent\work\bcdbe6b8cc677a49\src\Lucene.Net.TestFramework\Store\MockDirectoryWrapper.cs:line
1225
   at Lucene.Net.Index.SegmentCommitInfo.SizeInBytes() in z:\TeamCityAgent\work\bcdbe6b8cc677a49\src\Lucene.Net.Core\Index\SegmentCommitInfo.cs:line
169
   at Lucene.Net.Index.DocumentsWriterPerThread.SealFlushedSegment(FlushedSegment flushedSegment)
in z:\TeamCityAgent\work\bcdbe6b8cc677a49\src\Lucene.Net.Core\Index\DocumentsWriterPerThread.cs:line
614
   at Lucene.Net.Index.DocumentsWriterPerThread.Flush() in z:\TeamCityAgent\work\bcdbe6b8cc677a49\src\Lucene.Net.Core\Index\DocumentsWriterPerThread.cs:line
583
   at Lucene.Net.Index.DocumentsWriter.DoFlush(DocumentsWriterPerThread flushingDWPT) in z:\TeamCityAgent\work\bcdbe6b8cc677a49\src\Lucene.Net.Core\Index\DocumentsWriter.cs:line
635
   at Lucene.Net.Index.DocumentsWriter.PreUpdate() in z:\TeamCityAgent\work\bcdbe6b8cc677a49\src\Lucene.Net.Core\Index\DocumentsWriter.cs:line
458
   at Lucene.Net.Index.DocumentsWriter.UpdateDocument(IEnumerable`1 doc, Analyzer analyzer,
Term delTerm) in z:\TeamCityAgent\work\bcdbe6b8cc677a49\src\Lucene.Net.Core\Index\DocumentsWriter.cs:line
556
   at Lucene.Net.Index.IndexWriter.UpdateDocument(Term term, IEnumerable`1 doc, Analyzer analyzer)
in z:\TeamCityAgent\work\bcdbe6b8cc677a49\src\Lucene.Net.Core\Index\IndexWriter.cs:line 1831
   at Lucene.Net.Index.IndexWriter.AddDocument(IEnumerable`1 doc, Analyzer analyzer) in z:\TeamCityAgent\work\bcdbe6b8cc677a49\src\Lucene.Net.Core\Index\IndexWriter.cs:line
1456
   at Lucene.Net.Index.RandomIndexWriter.AddDocument(IEnumerable`1 doc, Analyzer a) in z:\TeamCityAgent\work\bcdbe6b8cc677a49\src\Lucene.Net.TestFramework\Index\RandomIndexWriter.cs:line
169
   at Lucene.Net.Index.RandomIndexWriter.AddDocument(IEnumerable`1 doc) in z:\TeamCityAgent\work\bcdbe6b8cc677a49\src\Lucene.Net.TestFramework\Index\RandomIndexWriter.cs:line
154
   at Lucene.Net.Index.TestNeverDelete.ThreadAnonymousInnerClassHelper.Run() in z:\TeamCityAgent\work\bcdbe6b8cc677a49\src\Lucene.Net.Tests\core\Index\TestNeverDelete.cs:line
142
   --- End of inner exception stack trace ---
   at Lucene.Net.Index.TestNeverDelete.ThreadAnonymousInnerClassHelper.Run() in z:\TeamCityAgent\work\bcdbe6b8cc677a49\src\Lucene.Net.Tests\core\Index\TestNeverDelete.cs:line
153
   at System.Threading.ThreadHelper.ThreadStart_Context(Object state)
   at System.Threading.ExecutionContext.RunInternal(ExecutionContext executionContext, ContextCallback
callback, Object state, Boolean preserveSyncCtx)
   at System.Threading.ExecutionContext.Run(ExecutionContext executionContext, ContextCallback
callback, Object state, Boolean preserveSyncCtx)
   at System.Threading.ExecutionContext.Run(ExecutionContext executionContext, ContextCallback
callback, Object state)
   at System.Threading.ThreadHelper.ThreadStart()
Unhandled exception in remote appdomain: System.Exception: Failed to compare two elements
in the array. ---> System.InvalidOperationException: Failed to compare two elements in
the array. ---> System.Exception: Could not find file 'Z:\TeamCityAgent\temp\buildTmp\LuceneTemp\TestNeverDelete-1\_q.fdx'.
---> System.IO.FileNotFoundException: Could not find file 'Z:\TeamCityAgent\temp\buildTmp\LuceneTemp\TestNeverDelete-1\_q.fdx'.
   at System.IO.__Error.WinIOError(Int32 errorCode, String maybeFullPath)
   at System.IO.FileInfo.get_Length()
   at Lucene.Net.Store.FSDirectory.FileLength(String name) in z:\TeamCityAgent\work\bcdbe6b8cc677a49\src\Lucene.Net.Core\Store\FSDirectory.cs:line
301
   at Lucene.Net.Store.MockDirectoryWrapper.FileLength(String name) in z:\TeamCityAgent\work\bcdbe6b8cc677a49\src\Lucene.Net.TestFramework\Store\MockDirectoryWrapper.cs:line
1225
   at Lucene.Net.Index.SegmentCommitInfo.SizeInBytes() in z:\TeamCityAgent\work\bcdbe6b8cc677a49\src\Lucene.Net.Core\Index\SegmentCommitInfo.cs:line
169
   at Lucene.Net.Index.MergePolicy.Size(SegmentCommitInfo info) in z:\TeamCityAgent\work\bcdbe6b8cc677a49\src\Lucene.Net.Core\Index\MergePolicy.cs:line
672
   at Lucene.Net.Index.TieredMergePolicy.SegmentByteSizeDescending.Compare(SegmentCommitInfo
o1, SegmentCommitInfo o2) in z:\TeamCityAgent\work\bcdbe6b8cc677a49\src\Lucene.Net.Core\Index\TieredMergePolicy.cs:line
351
   --- End of inner exception stack trace ---
   at Lucene.Net.Index.TieredMergePolicy.SegmentByteSizeDescending.Compare(SegmentCommitInfo
o1, SegmentCommitInfo o2) in z:\TeamCityAgent\work\bcdbe6b8cc677a49\src\Lucene.Net.Core\Index\TieredMergePolicy.cs:line
367
   at System.Collections.Generic.ArraySortHelper`1.SwapIfGreater(T[] keys, IComparer`1 comparer,
Int32 a, Int32 b)
   at System.Collections.Generic.ArraySortHelper`1.DepthLimitedQuickSort(T[] keys, Int32 left,
Int32 right, IComparer`1 comparer, Int32 depthLimit)
   at System.Collections.Generic.ArraySortHelper`1.Sort(T[] keys, Int32 index, Int32 length,
IComparer`1 comparer)
   --- End of inner exception stack trace ---
   at System.Collections.Generic.ArraySortHelper`1.Sort(T[] keys, Int32 index, Int32 length,
IComparer`1 comparer)
   at System.Array.Sort[T](T[] array, Int32 index, Int32 length, IComparer`1 comparer)
   at System.Collections.Generic.List`1.Sort(Int32 index, Int32 count, IComparer`1 comparer)
   at Lucene.Net.Index.TieredMergePolicy.FindMerges(Nullable`1 mergeTrigger, SegmentInfos
infos) in z:\TeamCityAgent\work\bcdbe6b8cc677a49\src\Lucene.Net.Core\Index\TieredMergePolicy.cs:line
413
   at Lucene.Net.Index.IndexWriter.UpdatePendingMerges(MergeTrigger trigger, Int32 maxNumSegments)
in z:\TeamCityAgent\work\bcdbe6b8cc677a49\src\Lucene.Net.Core\Index\IndexWriter.cs:line 2422
   at Lucene.Net.Index.IndexWriter.MaybeMerge(MergeTrigger trigger, Int32 maxNumSegments)
in z:\TeamCityAgent\work\bcdbe6b8cc677a49\src\Lucene.Net.Core\Index\IndexWriter.cs:line 2383
   at Lucene.Net.Index.IndexWriter.PrepareCommitInternal() in z:\TeamCityAgent\work\bcdbe6b8cc677a49\src\Lucene.Net.Core\Index\IndexWriter.cs:line
3637
   at Lucene.Net.Index.IndexWriter.CommitInternal() in z:\TeamCityAgent\work\bcdbe6b8cc677a49\src\Lucene.Net.Core\Index\IndexWriter.cs:line
3763
   at Lucene.Net.Index.RandomIndexWriter.Commit() in z:\TeamCityAgent\work\bcdbe6b8cc677a49\src\Lucene.Net.TestFramework\Index\RandomIndexWriter.cs:line
387
   at Lucene.Net.Index.TestNeverDelete.ThreadAnonymousInnerClassHelper.Run() in z:\TeamCityAgent\work\bcdbe6b8cc677a49\src\Lucene.Net.Tests\core\Index\TestNeverDelete.cs:line
146
   --- End of inner exception stack trace ---
   at Lucene.Net.Index.TestNeverDelete.ThreadAnonymousInnerClassHelper.Run() in z:\TeamCityAgent\work\bcdbe6b8cc677a49\src\Lucene.Net.Tests\core\Index\TestNeverDelete.cs:line
153
   at System.Threading.ThreadHelper.ThreadStart_Context(Object state)
   at System.Threading.ExecutionContext.RunInternal(ExecutionContext executionContext, ContextCallback
callback, Object state, Boolean preserveSyncCtx)
   at System.Threading.ExecutionContext.Run(ExecutionContext executionContext, ContextCallback
callback, Object state, Boolean preserveSyncCtx)
   at System.Threading.ExecutionContext.Run(ExecutionContext executionContext, ContextCallback
callback, Object state)
   at System.Threading.ThreadHelper.ThreadStart()
Lucene.Net.Tests.dll: Lucene.Net.Index.TestNumericDocValuesUpdates.TestUpdateOldSegments (new)
=================
Test(s) failed. System.IO.IOException : file "_0.fnm" was already written to
   at Lucene.Net.Store.MockDirectoryWrapper.CreateOutput(String name, IOContext context) in
z:\TeamCityAgent\work\bcdbe6b8cc677a49\src\Lucene.Net.TestFramework\Store\MockDirectoryWrapper.cs:line
657
   at Lucene.Net.Store.TrackingDirectoryWrapper.CreateOutput(String name, IOContext context)
in z:\TeamCityAgent\work\bcdbe6b8cc677a49\src\Lucene.Net.Core\Store\TrackingDirectoryWrapper.cs:line
44
   at Lucene.Net.Codecs.Lucene42.Lucene42FieldInfosWriter.Write(Directory directory, String
segmentName, String segmentSuffix, FieldInfos infos, IOContext context) in z:\TeamCityAgent\work\bcdbe6b8cc677a49\src\Lucene.Net.TestFramework\Codecs\lucene42\Lucene42FieldInfosWriter.cs:line
50
   at Lucene.Net.Index.ReadersAndUpdates.WriteFieldUpdates(Directory dir, Container dvUpdates)
in z:\TeamCityAgent\work\bcdbe6b8cc677a49\src\Lucene.Net.Core\Index\ReadersAndUpdates.cs:line
547
   at Lucene.Net.Index.BufferedUpdatesStream.ApplyDeletesAndUpdates(ReaderPool readerPool,
IList`1 infos) in z:\TeamCityAgent\work\bcdbe6b8cc677a49\src\Lucene.Net.Core\Index\BufferedUpdatesStream.cs:line
340
   at Lucene.Net.Index.IndexWriter.ApplyAllDeletesAndUpdates() in z:\TeamCityAgent\work\bcdbe6b8cc677a49\src\Lucene.Net.Core\Index\IndexWriter.cs:line
3949
   at Lucene.Net.Index.IndexWriter.MaybeApplyDeletes(Boolean applyAllDeletes) in z:\TeamCityAgent\work\bcdbe6b8cc677a49\src\Lucene.Net.Core\Index\IndexWriter.cs:line
3934
   at Lucene.Net.Index.IndexWriter.DoFlush(Boolean applyAllDeletes) in z:\TeamCityAgent\work\bcdbe6b8cc677a49\src\Lucene.Net.Core\Index\IndexWriter.cs:line
3895
   at Lucene.Net.Index.IndexWriter.CloseInternal(Boolean waitForMerges, Boolean doFlush) in
z:\TeamCityAgent\work\bcdbe6b8cc677a49\src\Lucene.Net.Core\Index\IndexWriter.cs:line 1177
   at Lucene.Net.Index.IndexWriter.Dispose(Boolean waitForMerges) in z:\TeamCityAgent\work\bcdbe6b8cc677a49\src\Lucene.Net.Core\Index\IndexWriter.cs:line
1102
   at Lucene.Net.Index.TestNumericDocValuesUpdates.TestUpdateOldSegments() in z:\TeamCityAgent\work\bcdbe6b8cc677a49\src\Lucene.Net.Tests\core\Index\TestNumericDocValuesUpdates.cs:line
1087
Lucene.Net.Tests.dll: Lucene.Net.Util.TestOfflineSorter.TestEmpty (new) =================
Test(s) failed. System.IO.FileNotFoundException : Could not find file 'Z:\TeamCityAgent\temp\buildTmp\LuceneTemp\mergesort-1\sorted'.
   at System.IO.__Error.WinIOError(Int32 errorCode, String maybeFullPath)
   at System.IO.FileStream.Init(String path, FileMode mode, FileAccess access, Int32 rights,
Boolean useRights, FileShare share, Int32 bufferSize, FileOptions options, SECURITY_ATTRIBUTES
secAttrs, String msgPath, Boolean bFromProxy, Boolean useLongPath, Boolean checkHost)
   at System.IO.FileStream..ctor(String path, FileMode mode, FileAccess access, FileShare
share, Int32 bufferSize, FileOptions options, String msgPath, Boolean bFromProxy)
   at System.IO.FileStream..ctor(String path, FileMode mode)
   at Lucene.Net.Util.OfflineSorter.ByteSequencesWriter..ctor(FileInfo file) in z:\TeamCityAgent\work\bcdbe6b8cc677a49\src\Lucene.Net.Core\Util\OfflineSorter.cs:line
532
   at Lucene.Net.Util.OfflineSorter.MergePartitions(IEnumerable`1 merges, FileInfo outputFile)
in z:\TeamCityAgent\work\bcdbe6b8cc677a49\src\Lucene.Net.Core\Util\OfflineSorter.cs:line 418
   at Lucene.Net.Util.OfflineSorter.Sort(FileInfo input, FileInfo output) in z:\TeamCityAgent\work\bcdbe6b8cc677a49\src\Lucene.Net.Core\Util\OfflineSorter.cs:line
342
   at Lucene.Net.Util.TestOfflineSorter.CheckSort(OfflineSorter sort, Byte[][] data) in z:\TeamCityAgent\work\bcdbe6b8cc677a49\src\Lucene.Net.Tests\core\Util\TestOfflineSorter.cs:line
156
   at Lucene.Net.Util.TestOfflineSorter.TestEmpty() in z:\TeamCityAgent\work\bcdbe6b8cc677a49\src\Lucene.Net.Tests\core\Util\TestOfflineSorter.cs:line
76
see all newly failed tests: http://teamcity.codebetter.com/viewLog.html?buildId=226811&buildTypeId=LuceneNet_Core



Other failed tests details (only first 3 failures shown here)
==================================================================
Lucene.Net.Tests.dll: Lucene.Net.Codecs.Perfield.TestPerFieldPostingsFormat2.TestChangeCodecAndMerge
=================
Test(s) failed. System.IO.EndOfStreamException : read past EOF: SlicedIndexInput(SlicedIndexInput(_0_MockSep_0.doc
in RAMInputStream(name=_0.cfs)) in RAMInputStream(name=_0.cfs) slice=153:153)
   at Lucene.Net.Index.SegmentInfos.FindSegmentsFile.Run(IndexCommit commit) in z:\TeamCityAgent\work\bcdbe6b8cc677a49\src\Lucene.Net.Core\Index\SegmentInfos.cs:line
1009
   at Lucene.Net.Index.StandardDirectoryReader.Open(Directory directory, IndexCommit commit,
Int32 termInfosIndexDivisor) in z:\TeamCityAgent\work\bcdbe6b8cc677a49\src\Lucene.Net.Core\Index\StandardDirectoryReader.cs:line
53
   at Lucene.Net.Codecs.Perfield.TestPerFieldPostingsFormat2.AssertQuery(Term t, Directory
dir, Int32 num) in z:\TeamCityAgent\work\bcdbe6b8cc677a49\src\Lucene.Net.Tests\core\Codecs\Perfield\TestPerFieldPostingsFormat2.cs:line
189
   at Lucene.Net.Codecs.Perfield.TestPerFieldPostingsFormat2.TestChangeCodecAndMerge() in
z:\TeamCityAgent\work\bcdbe6b8cc677a49\src\Lucene.Net.Tests\core\Codecs\Perfield\TestPerFieldPostingsFormat2.cs:line
128
Lucene.Net.Tests.dll: Lucene.Net.Codecs.Perfield.TestPerFieldPostingsFormat2.TestMergeUnusedPerFieldCodec
=================
Test(s) failed. System.Exception : CheckIndex failed
   at Lucene.Net.Util.TestUtil.CheckIndex(Directory dir, Boolean crossCheckTermVectors) in
z:\TeamCityAgent\work\bcdbe6b8cc677a49\src\Lucene.Net.TestFramework\Util\TestUtil.cs:line
162
   at Lucene.Net.Codecs.Perfield.TestPerFieldPostingsFormat2.TestMergeUnusedPerFieldCodec()
in z:\TeamCityAgent\work\bcdbe6b8cc677a49\src\Lucene.Net.Tests\core\Codecs\Perfield\TestPerFieldPostingsFormat2.cs:line
100
------- Stderr: -------
CheckIndex failed
´╗┐Segments file=segments_3 numSegments=3 version=4.8 format=
  1 of 3: name=_0 docCount=10
    codec=Lucene46
    compound=False
    numFiles=13
    size (MB)=0.000945091247558594
    diagnostics = System.Collections.Generic.Dictionary`2[System.String,System.String]
    no deletions
    test: open reader.........FAILED
    WARNING: fixIndex() would remove reference to this segment; full exception:
   at Lucene.Net.Store.MockDirectoryWrapper.OpenInput(String name, IOContext context) in z:\TeamCityAgent\work\bcdbe6b8cc677a49\src\Lucene.Net.TestFramework\Store\MockDirectoryWrapper.cs:line
784
   at Lucene.Net.Codecs.MockSep.MockSingleIntIndexInput..ctor(Directory dir, String fileName,
IOContext context) in z:\TeamCityAgent\work\bcdbe6b8cc677a49\src\Lucene.Net.TestFramework\Codecs\MockSep\MockSingleIntIndexInput.cs:line
37
   at Lucene.Net.Codecs.MockSep.MockSingleIntFactory.OpenInput(Directory dir, String fileName,
IOContext context) in z:\TeamCityAgent\work\bcdbe6b8cc677a49\src\Lucene.Net.TestFramework\Codecs\MockSep\MockSingleIntFactory.cs:line
27
   at Lucene.Net.Codecs.Sep.SepPostingsReader..ctor(Directory dir, FieldInfos fieldInfos,
SegmentInfo segmentInfo, IOContext context, IntStreamFactory intFactory, String segmentSuffix)
in z:\TeamCityAgent\work\bcdbe6b8cc677a49\src\Lucene.Net.Codecs\Sep\SepPostingsReader.cs:line
58
   at Lucene.Net.Codecs.MockSep.MockSepPostingsFormat.FieldsProducer(SegmentReadState state)
in z:\TeamCityAgent\work\bcdbe6b8cc677a49\src\Lucene.Net.TestFramework\Codecs\MockSep\MockSepPostingsFormat.cs:line
84
   at Lucene.Net.Codecs.Perfield.PerFieldPostingsFormat.FieldsReader..ctor(PerFieldPostingsFormat
outerInstance, SegmentReadState readState) in z:\TeamCityAgent\work\bcdbe6b8cc677a49\src\Lucene.Net.Core\Codecs\Perfield\PerFieldPostingsFormat.cs:line
216
   at Lucene.Net.Codecs.Perfield.PerFieldPostingsFormat.FieldsProducer(SegmentReadState state)
in z:\TeamCityAgent\work\bcdbe6b8cc677a49\src\Lucene.Net.Core\Codecs\Perfield\PerFieldPostingsFormat.cs:line
277
   at Lucene.Net.Index.SegmentCoreReaders..ctor(SegmentReader owner, Directory dir, SegmentCommitInfo
si, IOContext context, Int32 termsIndexDivisor) in z:\TeamCityAgent\work\bcdbe6b8cc677a49\src\Lucene.Net.Core\Index\SegmentCoreReaders.cs:line
151
   at Lucene.Net.Index.SegmentReader..ctor(SegmentCommitInfo si, Int32 termInfosIndexDivisor,
IOContext context) in z:\TeamCityAgent\work\bcdbe6b8cc677a49\src\Lucene.Net.Core\Index\SegmentReader.cs:line
111
   at Lucene.Net.Index.CheckIndex.DoCheckIndex(IList`1 onlySegments) in z:\TeamCityAgent\work\bcdbe6b8cc677a49\src\Lucene.Net.Core\Index\CheckIndex.cs:line
704
  2 of 3: name=_1 docCount=10
    codec=Lucene46
    compound=False
    numFiles=14
    size (MB)=0.00130748748779297
    diagnostics = System.Collections.Generic.Dictionary`2[System.String,System.String]
    no deletions
    test: open reader.........FAILED
    WARNING: fixIndex() would remove reference to this segment; full exception:
   at Lucene.Net.Store.MockDirectoryWrapper.OpenInput(String name, IOContext context) in z:\TeamCityAgent\work\bcdbe6b8cc677a49\src\Lucene.Net.TestFramework\Store\MockDirectoryWrapper.cs:line
784
   at Lucene.Net.Codecs.MockSep.MockSingleIntIndexInput..ctor(Directory dir, String fileName,
IOContext context) in z:\TeamCityAgent\work\bcdbe6b8cc677a49\src\Lucene.Net.TestFramework\Codecs\MockSep\MockSingleIntIndexInput.cs:line
37
   at Lucene.Net.Codecs.MockSep.MockSingleIntFactory.OpenInput(Directory dir, String fileName,
IOContext context) in z:\TeamCityAgent\work\bcdbe6b8cc677a49\src\Lucene.Net.TestFramework\Codecs\MockSep\MockSingleIntFactory.cs:line
27
   at Lucene.Net.Codecs.Sep.SepPostingsReader..ctor(Directory dir, FieldInfos fieldInfos,
SegmentInfo segmentInfo, IOContext context, IntStreamFactory intFactory, String segmentSuffix)
in z:\TeamCityAgent\work\bcdbe6b8cc677a49\src\Lucene.Net.Codecs\Sep\SepPostingsReader.cs:line
58
   at Lucene.Net.Codecs.MockSep.MockSepPostingsFormat.FieldsProducer(SegmentReadState state)
in z:\TeamCityAgent\work\bcdbe6b8cc677a49\src\Lucene.Net.TestFramework\Codecs\MockSep\MockSepPostingsFormat.cs:line
84
   at Lucene.Net.Codecs.Perfield.PerFieldPostingsFormat.FieldsReader..ctor(PerFieldPostingsFormat
outerInstance, SegmentReadState readState) in z:\TeamCityAgent\work\bcdbe6b8cc677a49\src\Lucene.Net.Core\Codecs\Perfield\PerFieldPostingsFormat.cs:line
216
   at Lucene.Net.Codecs.Perfield.PerFieldPostingsFormat.FieldsProducer(SegmentReadState state)
in z:\TeamCityAgent\work\bcdbe6b8cc677a49\src\Lucene.Net.Core\Codecs\Perfield\PerFieldPostingsFormat.cs:line
277
   at Lucene.Net.Index.SegmentCoreReaders..ctor(SegmentReader owner, Directory dir, SegmentCommitInfo
si, IOContext context, Int32 termsIndexDivisor) in z:\TeamCityAgent\work\bcdbe6b8cc677a49\src\Lucene.Net.Core\Index\SegmentCoreReaders.cs:line
151
   at Lucene.Net.Index.SegmentReader..ctor(SegmentCommitInfo si, Int32 termInfosIndexDivisor,
IOContext context) in z:\TeamCityAgent\work\bcdbe6b8cc677a49\src\Lucene.Net.Core\Index\SegmentReader.cs:line
111
   at Lucene.Net.Index.CheckIndex.DoCheckIndex(IList`1 onlySegments) in z:\TeamCityAgent\work\bcdbe6b8cc677a49\src\Lucene.Net.Core\Index\CheckIndex.cs:line
704
  3 of 3: name=_2 docCount=10
    codec=Lucene46
    compound=False
    numFiles=15
    size (MB)=0.00109481811523438
    diagnostics = System.Collections.Generic.Dictionary`2[System.String,System.String]
    no deletions
    test: open reader.........FAILED
    WARNING: fixIndex() would remove reference to this segment; full exception:
   at Lucene.Net.Store.MockDirectoryWrapper.OpenInput(String name, IOContext context) in z:\TeamCityAgent\work\bcdbe6b8cc677a49\src\Lucene.Net.TestFramework\Store\MockDirectoryWrapper.cs:line
784
   at Lucene.Net.Codecs.MockSep.MockSingleIntIndexInput..ctor(Directory dir, String fileName,
IOContext context) in z:\TeamCityAgent\work\bcdbe6b8cc677a49\src\Lucene.Net.TestFramework\Codecs\MockSep\MockSingleIntIndexInput.cs:line
37
   at Lucene.Net.Codecs.MockSep.MockSingleIntFactory.OpenInput(Directory dir, String fileName,
IOContext context) in z:\TeamCityAgent\work\bcdbe6b8cc677a49\src\Lucene.Net.TestFramework\Codecs\MockSep\MockSingleIntFactory.cs:line
27
   at Lucene.Net.Codecs.Sep.SepPostingsReader..ctor(Directory dir, FieldInfos fieldInfos,
SegmentInfo segmentInfo, IOContext context, IntStreamFactory intFactory, String segmentSuffix)
in z:\TeamCityAgent\work\bcdbe6b8cc677a49\src\Lucene.Net.Codecs\Sep\SepPostingsReader.cs:line
58
   at Lucene.Net.Codecs.MockSep.MockSepPostingsFormat.FieldsProducer(SegmentReadState state)
in z:\TeamCityAgent\work\bcdbe6b8cc677a49\src\Lucene.Net.TestFramework\Codecs\MockSep\MockSepPostingsFormat.cs:line
84
   at Lucene.Net.Codecs.Perfield.PerFieldPostingsFormat.FieldsReader..ctor(PerFieldPostingsFormat
outerInstance, SegmentReadState readState) in z:\TeamCityAgent\work\bcdbe6b8cc677a49\src\Lucene.Net.Core\Codecs\Perfield\PerFieldPostingsFormat.cs:line
216
   at Lucene.Net.Codecs.Perfield.PerFieldPostingsFormat.FieldsProducer(SegmentReadState state)
in z:\TeamCityAgent\work\bcdbe6b8cc677a49\src\Lucene.Net.Core\Codecs\Perfield\PerFieldPostingsFormat.cs:line
277
   at Lucene.Net.Index.SegmentCoreReaders..ctor(SegmentReader owner, Directory dir, SegmentCommitInfo
si, IOContext context, Int32 termsIndexDivisor) in z:\TeamCityAgent\work\bcdbe6b8cc677a49\src\Lucene.Net.Core\Index\SegmentCoreReaders.cs:line
151
   at Lucene.Net.Index.SegmentReader..ctor(SegmentCommitInfo si, Int32 termInfosIndexDivisor,
IOContext context) in z:\TeamCityAgent\work\bcdbe6b8cc677a49\src\Lucene.Net.Core\Index\SegmentReader.cs:line
111
   at Lucene.Net.Index.CheckIndex.DoCheckIndex(IList`1 onlySegments) in z:\TeamCityAgent\work\bcdbe6b8cc677a49\src\Lucene.Net.Core\Index\CheckIndex.cs:line
704
WARNING: 3 broken segments (containing 30 documents) detected
Lucene.Net.Tests.dll: Lucene.Net.Codecs.Perfield.TestPerFieldPostingsFormat2.TestSameCodecDifferentInstance
=================
Test(s) failed. System.Exception : CheckIndex failed
   at Lucene.Net.Util.TestUtil.CheckIndex(Directory dir, Boolean crossCheckTermVectors) in
z:\TeamCityAgent\work\bcdbe6b8cc677a49\src\Lucene.Net.TestFramework\Util\TestUtil.cs:line
162
   at Lucene.Net.Store.MockDirectoryWrapper.Dispose() in z:\TeamCityAgent\work\bcdbe6b8cc677a49\src\Lucene.Net.TestFramework\Store\MockDirectoryWrapper.cs:line
943
   at Lucene.Net.Codecs.Perfield.TestPerFieldPostingsFormat2.DoTestMixedPostings(Codec codec)
in z:\TeamCityAgent\work\bcdbe6b8cc677a49\src\Lucene.Net.Tests\core\Codecs\Perfield\TestPerFieldPostingsFormat2.cs:line
369
   at Lucene.Net.Codecs.Perfield.TestPerFieldPostingsFormat2.TestSameCodecDifferentInstance()
in z:\TeamCityAgent\work\bcdbe6b8cc677a49\src\Lucene.Net.Tests\core\Codecs\Perfield\TestPerFieldPostingsFormat2.cs:line
284
------- Stderr: -------
CheckIndex failed
´╗┐Segments file=segments_1 numSegments=1 version=4.8 format=
  1 of 1: name=_0 docCount=100
    codec=Lucene46
    compound=True
    numFiles=3
    size (MB)=0.00379180908203125
    diagnostics = System.Collections.Generic.Dictionary`2[System.String,System.String]
    no deletions
    test: open reader.........OK
    test: check integrity.....OK
    test: check live docs.....OK
    test: fields..............OK [2 fields]
    test: field norms.........OK [2 fields]
    test: terms, freq, prox...ERROR: System.ArgumentException: Could not instantiate implementing
class for Lucene.Net.Codecs.Pulsing.PulsingPostingsReader+IPulsingEnumAttribute
   at Lucene.Net.Util.AttributeSource.AttributeFactory.DefaultAttributeFactory.CreateAttributeInstance[S]()
in z:\TeamCityAgent\work\bcdbe6b8cc677a49\src\Lucene.Net.Core\Util\AttributeSource.cs:line
74
   at Lucene.Net.Util.AttributeSource.AddAttribute[T]() in z:\TeamCityAgent\work\bcdbe6b8cc677a49\src\Lucene.Net.Core\Util\AttributeSource.cs:line
350
   at Lucene.Net.Codecs.Pulsing.PulsingPostingsReader.SetOther(DocsEnum de, DocsEnum other)
in z:\TeamCityAgent\work\bcdbe6b8cc677a49\src\Lucene.Net.Codecs\Pulsing\PulsingPostingsReader.cs:line
290
   at Lucene.Net.Codecs.Pulsing.PulsingPostingsReader.Docs(FieldInfo field, BlockTermState
_termState, Bits liveDocs, DocsEnum reuse, Int32 flags) in z:\TeamCityAgent\work\bcdbe6b8cc677a49\src\Lucene.Net.Codecs\Pulsing\PulsingPostingsReader.cs:line
184
   at Lucene.Net.Codecs.BlockTreeTermsReader.FieldReader.SegmentTermsEnum.Docs(Bits skipDocs,
DocsEnum reuse, Int32 flags) in z:\TeamCityAgent\work\bcdbe6b8cc677a49\src\Lucene.Net.Core\Codecs\BlockTreeTermsReader.cs:line
2603
   at Lucene.Net.Index.CheckIndex.CheckFields(Fields fields, Bits liveDocs, Int32 maxDoc,
FieldInfos fieldInfos, Boolean doPrint, Boolean isVectors, StreamWriter infoStream, Boolean
verbose) in z:\TeamCityAgent\work\bcdbe6b8cc677a49\src\Lucene.Net.Core\Index\CheckIndex.cs:line
1071
   at Lucene.Net.Index.CheckIndex.TestPostings(AtomicReader reader, StreamWriter infoStream,
Boolean verbose) in z:\TeamCityAgent\work\bcdbe6b8cc677a49\src\Lucene.Net.Core\Index\CheckIndex.cs:line
1614
   at Lucene.Net.Util.AttributeSource.AttributeFactory.DefaultAttributeFactory.CreateAttributeInstance[S]()
in z:\TeamCityAgent\work\bcdbe6b8cc677a49\src\Lucene.Net.Core\Util\AttributeSource.cs:line
74
   at Lucene.Net.Util.AttributeSource.AddAttribute[T]() in z:\TeamCityAgent\work\bcdbe6b8cc677a49\src\Lucene.Net.Core\Util\AttributeSource.cs:line
350
   at Lucene.Net.Codecs.Pulsing.PulsingPostingsReader.SetOther(DocsEnum de, DocsEnum other)
in z:\TeamCityAgent\work\bcdbe6b8cc677a49\src\Lucene.Net.Codecs\Pulsing\PulsingPostingsReader.cs:line
290
   at Lucene.Net.Codecs.Pulsing.PulsingPostingsReader.Docs(FieldInfo field, BlockTermState
_termState, Bits liveDocs, DocsEnum reuse, Int32 flags) in z:\TeamCityAgent\work\bcdbe6b8cc677a49\src\Lucene.Net.Codecs\Pulsing\PulsingPostingsReader.cs:line
184
   at Lucene.Net.Codecs.BlockTreeTermsReader.FieldReader.SegmentTermsEnum.Docs(Bits skipDocs,
DocsEnum reuse, Int32 flags) in z:\TeamCityAgent\work\bcdbe6b8cc677a49\src\Lucene.Net.Core\Codecs\BlockTreeTermsReader.cs:line
2603
   at Lucene.Net.Index.CheckIndex.CheckFields(Fields fields, Bits liveDocs, Int32 maxDoc,
FieldInfos fieldInfos, Boolean doPrint, Boolean isVectors, StreamWriter infoStream, Boolean
verbose) in z:\TeamCityAgent\work\bcdbe6b8cc677a49\src\Lucene.Net.Core\Index\CheckIndex.cs:line
1071
   at Lucene.Net.Index.CheckIndex.TestPostings(AtomicReader reader, StreamWriter infoStream,
Boolean verbose) in z:\TeamCityAgent\work\bcdbe6b8cc677a49\src\Lucene.Net.Core\Index\CheckIndex.cs:line
1614
    test: stored fields.......OK [0 total field count; avg 0 fields per doc]
    test: term vectors........ERROR [Could not instantiate implementing class for Lucene.Net.Codecs.Pulsing.PulsingPostingsReader+IPulsingEnumAttribute]
   at Lucene.Net.Util.AttributeSource.AttributeFactory.DefaultAttributeFactory.CreateAttributeInstance[S]()
in z:\TeamCityAgent\work\bcdbe6b8cc677a49\src\Lucene.Net.Core\Util\AttributeSource.cs:line
74
   at Lucene.Net.Util.AttributeSource.AddAttribute[T]() in z:\TeamCityAgent\work\bcdbe6b8cc677a49\src\Lucene.Net.Core\Util\AttributeSource.cs:line
350
   at Lucene.Net.Codecs.Pulsing.PulsingPostingsReader.GetOther(DocsEnum de) in z:\TeamCityAgent\work\bcdbe6b8cc677a49\src\Lucene.Net.Codecs\Pulsing\PulsingPostingsReader.cs:line
281
   at Lucene.Net.Codecs.Pulsing.PulsingPostingsReader.DocsAndPositions(FieldInfo field, BlockTermState
_termState, Bits liveDocs, DocsAndPositionsEnum reuse, Int32 flags) in z:\TeamCityAgent\work\bcdbe6b8cc677a49\src\Lucene.Net.Codecs\Pulsing\PulsingPostingsReader.cs:line
215
   at Lucene.Net.Codecs.BlockTreeTermsReader.FieldReader.SegmentTermsEnum.DocsAndPositions(Bits
skipDocs, DocsAndPositionsEnum reuse, Int32 flags) in z:\TeamCityAgent\work\bcdbe6b8cc677a49\src\Lucene.Net.Core\Codecs\BlockTreeTermsReader.cs:line
2616
   at Lucene.Net.Index.CheckIndex.TestTermVectors(AtomicReader reader, StreamWriter infoStream,
Boolean verbose, Boolean crossCheckTermVectors) in z:\TeamCityAgent\work\bcdbe6b8cc677a49\src\Lucene.Net.Core\Index\CheckIndex.cs:line
2104
    test: docvalues...........OK [0 docvalues fields; 0 BINARY; 0 NUMERIC; 0 SORTED; 0 SORTED_SET]
FAILED
    WARNING: fixIndex() would remove reference to this segment; full exception:
   at Lucene.Net.Index.CheckIndex.DoCheckIndex(IList`1 onlySegments) in z:\TeamCityAgent\work\bcdbe6b8cc677a49\src\Lucene.Net.Core\Index\CheckIndex.cs:line
816
WARNING: 1 broken segments (containing 100 documents) detected
Changes included (154 changes, only 20 changes shown)
====================================================
Change 859d37ddfa7696f5ca4f4f4e5c31204cac3ea61e by conniey (1 file):
Changing SPIClassIterator to only accept classes with default ctor or IDict<string,string>
parameter


Change a4d0c4151cb0f6c8d18d2b1a156b4a3c28ca637e by shad (1 file):
Fixed bug in Core.Util.SPIClassIterator - it was ignoring types that have constructor parameters,
but the AnalysisSPILoader uses parameters.


Change f66eeb6d9bac57fa4914a65fcc30919a97b64b5f by conniey (1 file):
Only loading non-Microsoft Assemblies to search for public types


Change e8c4963a01372b6544b5da89743832a550323e55 by conniey (1 file):
Only loading non-Microsoft Assemblies to search for public types


Change a43d4e287446071d18c4b5ebc055554f36cb67f7 by conniey (1 file):
Making MockCodecs private so they are not loaded in SPIClassIterator


Change 625707c3eb884cc73fccb5706f47427200b3e023 by conniey (9 files):
Fixing test failures by adding default ctor in Codec classes


Change 7f877fdfc2ba25a7c1b0386795b4f83b46f50767 by shad (4 files):
Ported Analysis.Miscellaneous.PatternAnalyzer + tests


Change 8a05b1682b9d1405ed71d42e75d06a296736641d by shad (2 files):
Fixed some minor code differences in Analysis.Compound.Hyphenation


Change 3664f1d7dc4f31ce28ef36cbccc7d1cf9b79577f by shad (3 files):
Fixed a bug in the Analysis.Tr.TurkishLowerCaseFilter that caused the Analysis.Tr.TestTurkishLowerCaseFilter_.TestTurkishLowerCaseFilter()
test to fail.


Change bc48844b5b85542a6df5e6c409f17ed7a4634183 by shad (1 file):
Fixed 2 bugs in Analysis.PatternCaptureGroupTokenFilter that were causing Analysis.TestPatternCaptureGroupTokenFilter.TestRandom()
to fail.


Change defcabee7437ed8595bf841a3c332960c8a1ba9c by shad (3 files):
Fixed bug in Analysis.Hunspell and Core.Util.OfflineSorter where different threads have problems
competing for temp file usage.


Change 9ed5b8f3b44b0e2ede521608d7edaf4a9b81f92c by shad (2 files):
Ported Analysis.Core.TestAllAnalyzersHaveFactories.


Change 0a5198ecdacaf3ca71d4dbcf486ffa1430bad4e6 by shad (3 files):
Ported Analysis.Core.TestRandomChains and moved the CheckThatYouDidntReadAnythingReaderWrapper
back into that class from TestBugInSomething.


Change 4e9fd4f99d2b454928014d19fbc00b429998dc4b by shad (1 file):
Fixed formatting bug in BaseTokenStreamTestCase that was causing the input characters to be
excluded from the output message.


Change 91f0608859f1f92c41aeeef29c7a1e8a98ea051b by shad (1 file):
Fixed bug in HTMLStripCharFilter that was not allowing null characters to pass from the reader
to the business logic, which was causing the Analysis.CharFilters.HTMLStripCharFilterTest.TestRandom()
and Analysis.CharFilters.HTMLStripCharFilterTest.TestRandomHugeStrings() tests to fail.


Change 196ce641f26f0de13978f905ce890623f380c552 by shad (1 file):
Updated TestSynonymMap formatting to make them easier to read.


Change 63e3e22d8e4768e03295e7bdc07924120f307ad3 by shad (2 files):
Wrapped ICU4NET BreakIterator with a new class named ThaiWordBreaker to fix the broken behavior
of not splitting non-Thai and Thai characters into separate words.


Change ddd93cbadc184a6979d09be79f80309d3b0cf6d7 by shad (1 file):
Fixed casing of method names in SynonymFilter


Change edde0fba58612e1c82aed16da6d1ffb763798612 by shad (3 files):
Fixed several bugs that were causing most of the Analysis.Th tests to fail.


Change ab404469ef7e6ea59f4955eb9879508227718ea8 by shad (1 file):
Fixed casing of tests


see more information about changed files: http://teamcity.codebetter.com/viewLog.html?tab=buildChangesDiv&buildId=226811&buildTypeId=LuceneNet_Core

============================================================================
Configure email notifications: http://teamcity.codebetter.com/profile.html?init=1&tab=userNotifications

Mime
  • Unnamed multipart/alternative (inline, None, 0 bytes)
View raw message