lucenenet-dev mailing list archives

Site index · List index
Message view « Date » · « Thread »
Top « Date » · « Thread »
From Connie Yau <conn...@microsoft.com>
Subject RE: [TeamCity, FAILED] Build Lucene.NET :: Lucene.NET Nightly [master] #636
Date Sat, 20 Aug 2016 02:25:31 GMT
Hi,

I was wondering how the SPI magic (SPIClassIterator.cs) is supposed to work? The reason I
was getting different errors on VS2013 versus VS2015 was because the SPIClassIterator was
iterating through the classes in different order.  I wrote an IComparer that would order Lucene.Net.*
assembly types before *.Test assemblies but now I get a different set of errors.

One of the tests: https://github.com/apache/lucenenet/blob/master/src/Lucene.Net.Tests/core/Codecs/Lucene3x/TestImpersonation.cs
is failing because the PreFlexRWCodec is skipped from being added in NamedSPILoader (https://github.com/apache/lucenenet/blob/master/src/Lucene.Net.Core/Util/NamedSPILoader.cs#L68)
because the Lucene3xPosting codec was already added from Lucene.Net.dll

Any advice on how to consistently get the desired load order would be appreciated!

Thanks,
Connie

-----Original Message-----
From: Wyatt Barnett [mailto:wyatt.barnett@gmail.com] 
Sent: Tuesday, August 16, 2016 7:28 AM
To: dev@lucenenet.apache.org
Subject: Re: [TeamCity, FAILED] Build Lucene.NET :: Lucene.NET Nightly [master] #636

You get a different set of failures for vs 2015 :).

On Tuesday, August 16, 2016, Connie Yau <conniey@microsoft.com> wrote:

> I figured out that I could reproduce the failures when I ran the tests 
> after building in Visual Studio 2013 but they passed in Visual Studio 2015.
> :(  I'll look into them now.
>
> Connie
>
> -----Original Message-----
> From: Connie Yau [mailto:conniey@microsoft.com <javascript:;>]
> Sent: Monday, August 15, 2016 10:37 AM
> To: dev@lucenenet.apache.org <javascript:;>
> Subject: RE: [TeamCity, FAILED] Build Lucene.NET :: Lucene.NET Nightly 
> [master] #636
>
> Hi,
>
> I am looking into the failures that are occurring but am not able to 
> reproduce these.  What is the test setup that I need to perform in 
> order to duplicate these results?
>
> Thanks!
> Connie
>
> -----Original Message-----
> From: TeamCity at Codebetter [mailto:tc@codebetter.com <javascript:;>]
> Sent: Saturday, August 13, 2016 2:30 AM
> To: dev@lucenenet.apache.org <javascript:;>
> Subject: [TeamCity, FAILED] Build Lucene.NET :: Lucene.NET Nightly 
> [master] #636
>
> Build Lucene.NET :: Lucene.NET Nightly [master] #636 failed (Tests failed:
> 518 (433 new), passed: 2374, ignored: 174; snapshot dependency failed: ...
> Lucene.NET Core).
> Agent: JetBrains-dotnet-agent01
> Build results: https://na01.safelinks.protection.outlook.com/?url=
> http%3a%2f%2fteamcity.codebetter.com%2fviewLog.html%3fbuildId%3d225300
> % 26buildTypeId%3dLuceneNet_LuceneNetNightly&data=01%7c01%
> 7cconniey%40microsoft.com%7cd35b1474747f44a6069608d3c35c6e3c%
> 7c72f988bf86f141af91ab2d7cd011db47%7c1&sdata=
> 40wAWbFUOxVJ9JyPs5SXaylQkBtY0btKNQ7c3Lsn7Sg%3d
>
> Failed Tests Summary:
> Newly failed tests (433 tests, alphabetically ordered, only first 100
> shown) 
> ==================================================================
> Lucene.Net.Tests.Analysis.Common.dll: Lucene.Net.Tests.Analysis.
> Common.Analysis.Util.TestCharTokenizers.TestReadSupplementaryChars
> Lucene.Net.Tests.dll: 
> Lucene.Net.Codecs.Lucene3x.TestImpersonation.Test
> Lucene.Net.Tests.dll: Lucene.Net.Codecs.Lucene3x.
> TestLucene3xPostingsFormat.BaseIndexFileFormatTestCase.TestMergeStabil
> ity
> Lucene.Net.Tests.dll: Lucene.Net.Codecs.Lucene3x.
> TestLucene3xStoredFieldsFormat.BaseIndexFileFormatTestCase.
> TestMergeStability
> Lucene.Net.Tests.dll: Lucene.Net.Codecs.Lucene3x.
> TestLucene3xStoredFieldsFormat.BaseStoredFieldsFormatTestCase
> .TestBigDocuments
> Lucene.Net.Tests.dll: Lucene.Net.Codecs.Lucene3x.
> TestLucene3xStoredFieldsFormat.BaseStoredFieldsFormatTestCase
> .TestBinaryFieldOffsetLength
> Lucene.Net.Tests.dll: Lucene.Net.Codecs.Lucene3x.
> TestLucene3xStoredFieldsFormat.BaseStoredFieldsFormatTestCase
> .TestBulkMergeWithDeletes
> Lucene.Net.Tests.dll: Lucene.Net.Codecs.Lucene3x.
> TestLucene3xStoredFieldsFormat.BaseStoredFieldsFormatTestCase
> .TestConcurrentReads
> Lucene.Net.Tests.dll: Lucene.Net.Codecs.Lucene3x.
> TestLucene3xStoredFieldsFormat.BaseStoredFieldsFormatTestCase
> .TestEmptyDocs
> Lucene.Net.Tests.dll: Lucene.Net.Codecs.Lucene3x.
> TestLucene3xStoredFieldsFormat.BaseStoredFieldsFormatTestCase
> .TestIndexedBit
> Lucene.Net.Tests.dll: Lucene.Net.Codecs.Lucene3x.
> TestLucene3xStoredFieldsFormat.BaseStoredFieldsFormatTestCase.TestRead
> Skip
> Lucene.Net.Tests.dll: Lucene.Net.Codecs.Lucene3x.
> TestLucene3xStoredFieldsFormat.BaseStoredFieldsFormatTestCase
> .TestStoredFieldsOrder
> Lucene.Net.Tests.dll: Lucene.Net.Codecs.Lucene3x.
> TestLucene3xTermVectorsFormat.BaseIndexFileFormatTestCase.
> TestMergeStability
> Lucene.Net.Tests.dll: Lucene.Net.Codecs.Lucene3x.
> TestLucene3xTermVectorsFormat.BaseTermVectorsFormatTestCase.TestClone
> Lucene.Net.Tests.dll: Lucene.Net.Codecs.Lucene3x.
> TestLucene3xTermVectorsFormat.BaseTermVectorsFormatTestCase.TestHighFr
> eqs
> Lucene.Net.Tests.dll: Lucene.Net.Codecs.Lucene3x.
> TestLucene3xTermVectorsFormat.BaseTermVectorsFormatTestCase.
> TestLotsOfFields
> Lucene.Net.Tests.dll: Lucene.Net.Codecs.Lucene3x.
> TestLucene3xTermVectorsFormat.BaseTermVectorsFormatTestCase.TestMerge
> Lucene.Net.Tests.dll: Lucene.Net.Codecs.Lucene3x.
> TestLucene3xTermVectorsFormat.BaseTermVectorsFormatTestCase.
> TestMixedOptions
> Lucene.Net.Tests.dll: Lucene.Net.Codecs.Lucene3x.
> TestLucene3xTermVectorsFormat.BaseTermVectorsFormatTestCase.TestRandom
> Lucene.Net.Tests.dll: Lucene.Net.Codecs.Lucene3x.
> TestLucene3xTermVectorsFormat.BaseTermVectorsFormatTestCase.
> TestRareVectors
> Lucene.Net.Tests.dll: Lucene.Net.Codecs.Lucene3x.TestSurrogates.
> TestSurrogatesOrder
> Lucene.Net.Tests.dll: 
> Lucene.Net.Codecs.Lucene3x.TestTermInfosReaderIndex
> Lucene.Net.Tests.dll: Lucene.Net.Codecs.Lucene40.
> TestLucene40DocValuesFormat.BaseDocValuesFormatTestCase.
> TestBinaryFixedLengthVsStoredFields
> Lucene.Net.Tests.dll: Lucene.Net.Codecs.Lucene40.
> TestLucene40DocValuesFormat.BaseDocValuesFormatTestCase.
> TestBinaryVariableLengthVsStoredFields
> Lucene.Net.Tests.dll: Lucene.Net.Codecs.Lucene40.
> TestLucene40DocValuesFormat.BaseDocValuesFormatTestCase.
> TestBooleanNumericsVsStoredFields
> Lucene.Net.Tests.dll: Lucene.Net.Codecs.Lucene40.
> TestLucene40DocValuesFormat.BaseDocValuesFormatTestCase.
> TestByteNumericsVsStoredFields
> Lucene.Net.Tests.dll: Lucene.Net.Codecs.Lucene40.
> TestLucene40DocValuesFormat.BaseDocValuesFormatTestCase.TestBytes
> Lucene.Net.Tests.dll: Lucene.Net.Codecs.Lucene40.
> TestLucene40DocValuesFormat.BaseDocValuesFormatTestCase.
> TestBytesTwoDocumentsMerged
> Lucene.Net.Tests.dll: Lucene.Net.Codecs.Lucene40.
> TestLucene40DocValuesFormat.BaseDocValuesFormatTestCase.
> TestDocValuesSimple
> Lucene.Net.Tests.dll: Lucene.Net.Codecs.Lucene40.
> TestLucene40DocValuesFormat.BaseDocValuesFormatTestCase.TestGCDCompres
> sion
> Lucene.Net.Tests.dll: Lucene.Net.Codecs.Lucene40.
> TestLucene40DocValuesFormat.BaseDocValuesFormatTestCase.
> TestHugeBinaryValueLimit
> Lucene.Net.Tests.dll: Lucene.Net.Codecs.Lucene40.
> TestLucene40DocValuesFormat.BaseDocValuesFormatTestCase.
> TestIntNumericsVsStoredFields
> Lucene.Net.Tests.dll: Lucene.Net.Codecs.Lucene40.
> TestLucene40DocValuesFormat.BaseDocValuesFormatTestCase.
> TestLongNumericsVsStoredFields
> Lucene.Net.Tests.dll: Lucene.Net.Codecs.Lucene40.
> TestLucene40DocValuesFormat.BaseDocValuesFormatTestCase.TestOneFloat
> Lucene.Net.Tests.dll: Lucene.Net.Codecs.Lucene40.
> TestLucene40DocValuesFormat.BaseDocValuesFormatTestCase.TestOneNumber
> Lucene.Net.Tests.dll: Lucene.Net.Codecs.Lucene40.
> TestLucene40DocValuesFormat.BaseDocValuesFormatTestCase.
> TestRandomSortedBytes
> Lucene.Net.Tests.dll: Lucene.Net.Codecs.Lucene40.
> TestLucene40DocValuesFormat.BaseDocValuesFormatTestCase.
> TestShortNumericsVsStoredFields
> Lucene.Net.Tests.dll: Lucene.Net.Codecs.Lucene40.
> TestLucene40DocValuesFormat.BaseDocValuesFormatTestCase.TestSortedByte
> s
> Lucene.Net.Tests.dll: Lucene.Net.Codecs.Lucene40.
> TestLucene40DocValuesFormat.BaseDocValuesFormatTestCase.
> TestSortedBytesTwoDocumentsMerged
> Lucene.Net.Tests.dll: Lucene.Net.Codecs.Lucene40.
> TestLucene40DocValuesFormat.BaseDocValuesFormatTestCase.
> TestSortedFixedLengthVsFieldCache
> Lucene.Net.Tests.dll: Lucene.Net.Codecs.Lucene40.
> TestLucene40DocValuesFormat.BaseDocValuesFormatTestCase.
> TestSortedFixedLengthVsStoredFields
> Lucene.Net.Tests.dll: Lucene.Net.Codecs.Lucene40.
> TestLucene40DocValuesFormat.BaseDocValuesFormatTestCase.
> TestSortedMergeAwayAllValues
> Lucene.Net.Tests.dll: Lucene.Net.Codecs.Lucene40.
> TestLucene40DocValuesFormat.BaseDocValuesFormatTestCase.
> TestSortedVariableLengthVsFieldCache
> Lucene.Net.Tests.dll: Lucene.Net.Codecs.Lucene40.
> TestLucene40DocValuesFormat.BaseDocValuesFormatTestCase.
> TestSortedVariableLengthVsStoredFields
> Lucene.Net.Tests.dll: Lucene.Net.Codecs.Lucene40.
> TestLucene40DocValuesFormat.BaseDocValuesFormatTestCase.TestThreads
> Lucene.Net.Tests.dll: Lucene.Net.Codecs.Lucene40.
> TestLucene40DocValuesFormat.BaseDocValuesFormatTestCase.
> TestThreeFieldsMixed
> Lucene.Net.Tests.dll: Lucene.Net.Codecs.Lucene40.
> TestLucene40DocValuesFormat.BaseDocValuesFormatTestCase.
> TestThreeFieldsMixed2
> Lucene.Net.Tests.dll: Lucene.Net.Codecs.Lucene40.
> TestLucene40DocValuesFormat.BaseDocValuesFormatTestCase.
> TestTwoBinaryValues
> Lucene.Net.Tests.dll: Lucene.Net.Codecs.Lucene40.
> TestLucene40DocValuesFormat.BaseDocValuesFormatTestCase.
> TestTwoDocumentsMerged
> Lucene.Net.Tests.dll: Lucene.Net.Codecs.Lucene40.
> TestLucene40DocValuesFormat.BaseDocValuesFormatTestCase.TestTwoFieldsM
> ixed
> Lucene.Net.Tests.dll: Lucene.Net.Codecs.Lucene40.
> TestLucene40DocValuesFormat.BaseDocValuesFormatTestCase.TestTwoNumbers
> Lucene.Net.Tests.dll: Lucene.Net.Codecs.Lucene40.
> TestLucene40PostingsFormat.BaseIndexFileFormatTestCase.TestMergeStabil
> ity
> Lucene.Net.Tests.dll: Lucene.Net.Codecs.Lucene40.
> TestLucene40PostingsFormat.BasePostingsFormatTestCase.TestDocsAndFreqs
> Lucene.Net.Tests.dll: Lucene.Net.Codecs.Lucene40.
> TestLucene40PostingsFormat.BasePostingsFormatTestCase.
> TestDocsAndFreqsAndPositions
> Lucene.Net.Tests.dll: Lucene.Net.Codecs.Lucene40.
> TestLucene40PostingsFormat.BasePostingsFormatTestCase.
> TestDocsAndFreqsAndPositionsAndOffsets
> Lucene.Net.Tests.dll: Lucene.Net.Codecs.Lucene40.
> TestLucene40PostingsFormat.BasePostingsFormatTestCase.
> TestDocsAndFreqsAndPositionsAndOffsetsAndPayloads
> Lucene.Net.Tests.dll: Lucene.Net.Codecs.Lucene40.
> TestLucene40PostingsFormat.BasePostingsFormatTestCase.
> TestDocsAndFreqsAndPositionsAndPayloads
> Lucene.Net.Tests.dll: Lucene.Net.Codecs.Lucene40.
> TestLucene40PostingsFormat.BasePostingsFormatTestCase.TestDocsOnly
> Lucene.Net.Tests.dll: Lucene.Net.Codecs.Lucene40.
> TestLucene40PostingsFormat.BasePostingsFormatTestCase.TestRandom
> Lucene.Net.Tests.dll: Lucene.Net.Codecs.Lucene40.
> TestLucene40PostingsReader.TestPostings
> Lucene.Net.Tests.dll: Lucene.Net.Codecs.Lucene40.
> TestLucene40StoredFieldsFormat.BaseStoredFieldsFormatTestCase
> .TestBigDocuments
> Lucene.Net.Tests.dll: Lucene.Net.Codecs.Lucene40.
> TestLucene40StoredFieldsFormat.BaseStoredFieldsFormatTestCase
> .TestBulkMergeWithDeletes
> Lucene.Net.Tests.dll: Lucene.Net.Codecs.Lucene40.
> TestLucene40StoredFieldsFormat.BaseStoredFieldsFormatTestCase
> .TestConcurrentReads
> Lucene.Net.Tests.dll: Lucene.Net.Codecs.Lucene40.
> TestLucene40StoredFieldsFormat.BaseStoredFieldsFormatTestCase
> .TestIndexedBit
> Lucene.Net.Tests.dll: Lucene.Net.Codecs.Lucene40.
> TestLucene40StoredFieldsFormat.BaseStoredFieldsFormatTestCase.TestRead
> Skip
> Lucene.Net.Tests.dll: Lucene.Net.Codecs.Lucene40.
> TestLucene40StoredFieldsFormat.BaseStoredFieldsFormatTestCase
> .TestWriteReadMerge
> Lucene.Net.Tests.dll: Lucene.Net.Codecs.Lucene40.
> TestLucene40TermVectorsFormat.BaseIndexFileFormatTestCase.
> TestMergeStability
> Lucene.Net.Tests.dll: Lucene.Net.Codecs.Lucene40.
> TestLucene40TermVectorsFormat.BaseTermVectorsFormatTestCase.TestClone
> Lucene.Net.Tests.dll: Lucene.Net.Codecs.Lucene40.
> TestLucene40TermVectorsFormat.BaseTermVectorsFormatTestCase.TestHighFr
> eqs
> Lucene.Net.Tests.dll: Lucene.Net.Codecs.Lucene40.
> TestLucene40TermVectorsFormat.BaseTermVectorsFormatTestCase.
> TestLotsOfFields
> Lucene.Net.Tests.dll: Lucene.Net.Codecs.Lucene40.
> TestLucene40TermVectorsFormat.BaseTermVectorsFormatTestCase.TestMerge
> Lucene.Net.Tests.dll: Lucene.Net.Codecs.Lucene40.
> TestLucene40TermVectorsFormat.BaseTermVectorsFormatTestCase.
> TestMixedOptions
> Lucene.Net.Tests.dll: Lucene.Net.Codecs.Lucene40.
> TestLucene40TermVectorsFormat.BaseTermVectorsFormatTestCase.TestRandom
> Lucene.Net.Tests.dll: Lucene.Net.Codecs.Lucene40.
> TestLucene40TermVectorsFormat.BaseTermVectorsFormatTestCase.
> TestRareVectors
> Lucene.Net.Tests.dll: Lucene.Net.Codecs.Perfield.
> TestPerFieldPostingsFormat2.TestChangeCodecAndMerge
> Lucene.Net.Tests.dll: Lucene.Net.Codecs.Perfield.
> TestPerFieldPostingsFormat2.TestMergeUnusedPerFieldCodec
> Lucene.Net.Tests.dll: Lucene.Net.Codecs.Perfield.
> TestPerFieldPostingsFormat2.TestSameCodecDifferentInstance
> Lucene.Net.Tests.dll: Lucene.Net.Codecs.Perfield.
> TestPerFieldPostingsFormat2.TestSameCodecDifferentParams
> Lucene.Net.Tests.dll: 
> Lucene.Net.Document.TestDocument.TestFieldSetValue
> Lucene.Net.Tests.dll: Lucene.Net.Index.TestAddIndexes.
> TestAddIndexesWithClose
> Lucene.Net.Tests.dll: Lucene.Net.Index.TestAddIndexes.
> TestAddIndexesWithCloseNoWait
> Lucene.Net.Tests.dll: Lucene.Net.Index.TestAddIndexes.
> TestAddIndexesWithRollback
> Lucene.Net.Tests.dll: Lucene.Net.Index.TestAddIndexes.
> TestAddIndexesWithThreads
> Lucene.Net.Tests.dll: Lucene.Net.Index.TestAddIndexes.TestAddSelf
> Lucene.Net.Tests.dll: 
> Lucene.Net.Index.TestAddIndexes.TestExistingDeletes
> Lucene.Net.Tests.dll: Lucene.Net.Index.TestAddIndexes.
> TestFieldNamesChanged
> Lucene.Net.Tests.dll: Lucene.Net.Index.TestAddIndexes.TestHangOnClose
> Lucene.Net.Tests.dll: 
> Lucene.Net.Index.TestAddIndexes.TestMergeAfterCopy
> Lucene.Net.Tests.dll: Lucene.Net.Index.TestAddIndexes.TestMoreMerges
> Lucene.Net.Tests.dll: 
> Lucene.Net.Index.TestAddIndexes.TestNoCopySegments
> Lucene.Net.Tests.dll: 
> Lucene.Net.Index.TestAddIndexes.TestNoMergeAfterCopy
> Lucene.Net.Tests.dll: 
> Lucene.Net.Index.TestAddIndexes.TestNoTailSegments
> Lucene.Net.Tests.dll: Lucene.Net.Index.TestAddIndexes.TestSimpleCase
> Lucene.Net.Tests.dll: Lucene.Net.Index.TestAddIndexes.
> TestWithPendingDeletes
> Lucene.Net.Tests.dll: Lucene.Net.Index.TestAddIndexes.
> TestWithPendingDeletes2
> Lucene.Net.Tests.dll: Lucene.Net.Index.TestAddIndexes.
> TestWithPendingDeletes3
> Lucene.Net.Tests.dll: 
> Lucene.Net.Index.TestAtomicUpdate.TestAtomicUpdates
> Lucene.Net.Tests.dll: Lucene.Net.Index.TestBinaryDocValuesUpdates.
> TestAddIndexes
> Lucene.Net.Tests.dll: Lucene.Net.Index.TestBinaryDocValuesUpdates.
> TestDeleteUnusedUpdatesFiles
> Lucene.Net.Tests.dll: Lucene.Net.Index.TestBinaryDocValuesUpdates.
> TestManyReopensAndFields
>
> Other failed tests (85 tests, alphabetically ordered) 
> ==================================================================
>
>
>
> Other failed tests details (only first 3 failures shown here) 
> ==================================================================
> Lucene.Net.Tests.Join.dll: 
> Lucene.Net.Tests.Join.TestJoinUtil.TestMultiValueRandomJoin
> =================
> Test(s) failed. System.Collections.Generic.KeyNotFoundException : The 
> given key was not present in the dictionary.
>    at System.Collections.Generic.Dictionary`2.get_Item(TKey key)
>    at 
> Lucene.Net.Tests.Join.TestJoinUtil.CollectorAnonymousInnerClassHelper3
> .Collect(Int32
> doc) in z:\TeamCityAgent\work\bcdbe6b8cc677a49\src\Lucene.
> Net.Tests.Join\TestJoinUtil.cs:line 799
>    at Lucene.Net.Search.Weight.DefaultBulkScorer.ScoreAll(Collector
> collector, Scorer scorer) in z:\TeamCityAgent\work\ 
> bcdbe6b8cc677a49\src\Lucene.Net.Core\Search\Weight.cs:line 198
>    at Lucene.Net.Search.Weight.DefaultBulkScorer.Score(Collector
> collector, Int32 max) in z:\TeamCityAgent\work\ 
> bcdbe6b8cc677a49\src\Lucene.Net.Core\Search\Weight.cs:line 169
>    at Lucene.Net.Search.AssertingBulkScorer.Score(Collector collector) 
> in z:\TeamCityAgent\work\bcdbe6b8cc677a49\src\Lucene.
> Net.TestFramework\Search\AssertingBulkScorer.cs:line 71
>    at Lucene.Net.Search.IndexSearcher.Search(IList`1 leaves, Weight 
> weight, Collector collector) in z:\TeamCityAgent\work\ 
> bcdbe6b8cc677a49\src\Lucene.Net.Core\Search\IndexSearcher.cs:line 658
>    at Lucene.Net.Search.AssertingIndexSearcher.Search(IList`1 leaves, 
> Weight weight, Collector collector) in z:\TeamCityAgent\work\ 
> bcdbe6b8cc677a49\src\Lucene.Net.TestFramework\Search\AssertingIndexSea
> rcher.cs:line
> 116
>    at Lucene.Net.Search.IndexSearcher.Search(Query query, Collector
> results) in z:\TeamCityAgent\work\bcdbe6b8cc677a49\src\Lucene.
> Net.Core\Search\IndexSearcher.cs:line 329
>    at Lucene.Net.Tests.Join.TestJoinUtil.CreateContext(Int32 nDocs, 
> RandomIndexWriter fromWriter, RandomIndexWriter toWriter, Boolean 
> multipleValuesPerDocument, Boolean scoreDocsInOrder) in 
> z:\TeamCityAgent\work\bcdbe6b8cc677a49\src\Lucene.
> Net.Tests.Join\TestJoinUtil.cs:line 700
>    at Lucene.Net.Tests.Join.TestJoinUtil.ExecuteRandomJoin(Boolean
> multipleValuesPerDocument, Int32 maxIndexIter, Int32 maxSearchIter, 
> Int32
> numberOfDocumentsToIndex) in z:\TeamCityAgent\work\ 
> bcdbe6b8cc677a49\src\Lucene.Net.Tests.Join\TestJoinUtil.cs:line 419
>    at Lucene.Net.Tests.Join.TestJoinUtil.TestMultiValueRandomJoin() in 
> z:\TeamCityAgent\work\bcdbe6b8cc677a49\src\Lucene.
> Net.Tests.Join\TestJoinUtil.cs:line 404
> Lucene.Net.Tests.Join.dll: Lucene.Net.Tests.Join.TestJoinUtil.
> TestOverflowTermsWithScoreCollector =================
> Test(s) failed. System.NotImplementedException : The method or 
> operation is not implemented.
>    at 
> Lucene.Net.Join.TermsWithScoreCollector.Mv.AcceptsDocsOutOfOrder()
> in z:\TeamCityAgent\work\bcdbe6b8cc677a49\src\Lucene.Net.Join\
> TermsWithScoreCollector.cs:line 276
>    at Lucene.Net.Search.IndexSearcher.Search(IList`1 leaves, Weight 
> weight, Collector collector) in z:\TeamCityAgent\work\ 
> bcdbe6b8cc677a49\src\Lucene.Net.Core\Search\IndexSearcher.cs:line 653
>    at Lucene.Net.Search.IndexSearcher.Search(Query query, Collector
> results) in z:\TeamCityAgent\work\bcdbe6b8cc677a49\src\Lucene.
> Net.Core\Search\IndexSearcher.cs:line 329
>    at Lucene.Net.Join.JoinUtil.CreateJoinQuery(String fromField, 
> Boolean multipleValuesPerDocument, String toField, Query fromQuery, 
> IndexSearcher fromSearcher, ScoreMode scoreMode) in 
> z:\TeamCityAgent\work\ bcdbe6b8cc677a49\src\Lucene.Net.Join\JoinUtil.cs:line 73
>    at Lucene.Net.Tests.Join.TestJoinUtil.Test300spartans(Boolean
> multipleValues, ScoreMode scoreMode) in z:\TeamCityAgent\work\ 
> bcdbe6b8cc677a49\src\Lucene.Net.Tests.Join\TestJoinUtil.cs:line 168
>    at 
> Lucene.Net.Tests.Join.TestJoinUtil.TestOverflowTermsWithScoreCollector
> () in z:\TeamCityAgent\work\bcdbe6b8cc677a49\src\Lucene.
> Net.Tests.Join\TestJoinUtil.cs:line 124
> Lucene.Net.Tests.Join.dll: Lucene.Net.Tests.Join.TestJoinUtil.
> TestOverflowTermsWithScoreCollectorRandom =================
> Test(s) failed. System.NotImplementedException : The method or 
> operation is not implemented.
>    at 
> Lucene.Net.Join.TermsWithScoreCollector.Mv.AcceptsDocsOutOfOrder()
> in z:\TeamCityAgent\work\bcdbe6b8cc677a49\src\Lucene.Net.Join\
> TermsWithScoreCollector.cs:line 276
>    at Lucene.Net.Search.IndexSearcher.Search(IList`1 leaves, Weight 
> weight, Collector collector) in z:\TeamCityAgent\work\ 
> bcdbe6b8cc677a49\src\Lucene.Net.Core\Search\IndexSearcher.cs:line 653
>    at Lucene.Net.Search.IndexSearcher.Search(Query query, Collector
> results) in z:\TeamCityAgent\work\bcdbe6b8cc677a49\src\Lucene.
> Net.Core\Search\IndexSearcher.cs:line 329
>    at Lucene.Net.Join.JoinUtil.CreateJoinQuery(String fromField, 
> Boolean multipleValuesPerDocument, String toField, Query fromQuery, 
> IndexSearcher fromSearcher, ScoreMode scoreMode) in 
> z:\TeamCityAgent\work\ bcdbe6b8cc677a49\src\Lucene.Net.Join\JoinUtil.cs:line 73
>    at Lucene.Net.Tests.Join.TestJoinUtil.Test300spartans(Boolean
> multipleValues, ScoreMode scoreMode) in z:\TeamCityAgent\work\ 
> bcdbe6b8cc677a49\src\Lucene.Net.Tests.Join\TestJoinUtil.cs:line 168
>    at 
> Lucene.Net.Tests.Join.TestJoinUtil.TestOverflowTermsWithScoreCollector
> Random() in z:\TeamCityAgent\work\bcdbe6b8cc677a49\src\Lucene.
> Net.Tests.Join\TestJoinUtil.cs:line 130 Changes included (28 changes, 
> only 20 changes shown) ============================== 
> ====================== Change 8ce8e81fb06d43a44974436d79dadd33197bf0e0 
> by itamar (0 file):
> Merge remote-tracking branch '888/core-tests'
>
>
> Change 9e84366542f0368e9f3a690e9e0bc57fe7f048cb by itamar (0 file):
> Merge remote-tracking branch 'conniey/notRemovingCtors'
>
>
> Change 13fadeb78cad47c66b8b045bbc1e6405f0cf5c8e by conniey (59 files):
> Adding LUCENENET specific comments to APIs that changed
>
>
> Change 22caeb07679f12baa8eee4311c4ffc44a4970880 by conniey (1 file):
> Fixing bug where incorrect searcher variable was used
>
>
> Change be84fe26e92a2c11613978d73f01d6eb662ca922 by conniey (4 files):
> Adding LUCENENET specific documentation
>
>
> Change 1863bb825d83bca3cfa9e260a571c9681aee594b by conniey (2 files):
> Fixing bug where class rather than local variable was used
>
>
> Change 4d0877f25d0158a5299ffa83b67c1e3b03b2e600 by shad (8 files):
> Ported Core.Codecs.Perfield.TestPerFieldPostingsFormat2 tests and 
> removed [Test] attribute from 2 non-tests.
>
>
> Change c8e1eae628e07b06ae2f31512c9955d66d4b81ca by conniey (136 files):
> Passing Similarity and TimeZone into RandomIndexWriter ctors.
>
>
> Change f772f19daecf8b7b139b38a9662dc19d110c8432 by conniey (23 files):
> Injecting OLD_FORMAT_IMPERSONATION_IS_ACTIVE into Codecs so that they 
> do not reference static value
>
>
> Change b9bb484d00225721081efc02782ce9191be8a83a by conniey (3 files):
> Adding TestWriterMethods so that it does not rely on external static 
> call
>
>
> Change c15ab48b5d3f4b75672ef06c90c7ae645f9cd3e9 by conniey (18 files):
> Changing methods that do not have to be static to non-static. (ie.
> TestFixture TearDown/Setup)
>
>
> Change 3930ae4a014c336e73ed4bc24a867e18be4b008f by conniey (1 file):
> Exposing external getters for ClassEnvRule.TimeZone and Similarity
>
>
> Change 95bd05b76fbde14a852e789dc4c445dc93cb7d6e by conniey (16 files):
> Fixing non-static calls from private classes using OuterInstance
>
>
> Change 659d95221eb57e05d47f1292efa47ef2266b6bf3 by conniey (1 file):
> Fixing RandomIndexWriter ctor error in SearchEquivalentTestBase
>
>
> Change 9067582a3bf68430a789e641670e3a96fe688d95 by conniey (1 file):
> Fixing NewSearcher errors in QueryUtils
>
>
> Change 72840c6544d310155d7e1849283d9ec38bab79c3 by conniey (1 file):
> Fixing NewField build errors in ThreadingIndexingAndSearching
>
>
> Change 9591b70d96a9ee08d23421e70c41c6363967b37a by conniey (1 file):
> Fixing RandomIndexWriter build errors in BaseTokenStreamTestCase
>
>
> Change ef7f1dd17feda9fbb1a2cc02d5f764268d7e7354 by conniey (1 file):
> Adding another overload for LuceneTestCase.NewSearcher
>
>
> Change c499981985b086d31699bde5438ff0bc410d7e37 by conniey (1 file):
> Making LuceneTestCase.NewField/NewTextField non-static
>
>
> Change 8be2a5433039c6daa114a1632ae2056bd8de148e by conniey (1 file):
> Adding parameters to static NewSearcher
>
>
> see more information about changed files: https://na01.safelinks.protection.outlook.com/?url=https%3a%2f%2fna01.safelinks&data=01%7c01%7cconniey%40microsoft.com%7cd9eb95fb8bdb44235bff08d3c5e199a2%7c72f988bf86f141af91ab2d7cd011db47%7c1&sdata=rm5avGHU9LYs4h%2bf0MUgM7wiSWL0lNgT6gpYuPB4%2b94%3d.
> protection.outlook.com/?url=http%3a%2f%2fteamcity.
> codebetter.com%2fviewLog.html%3ftab%3dbuildChangesDiv%26buildId%3d2253
> 00% 26buildTypeId%3dLuceneNet_LuceneNetNightly&data=01%7c01%
> 7cconniey%40microsoft.com%7cd35b1474747f44a6069608d3c35c6e3c%
> 7c72f988bf86f141af91ab2d7cd011db47%7c1&sdata=
> EWjQ1bNlWWsrmYsXJwd2LEwIW6R4JrkHEOSd7qShcu4%3d
>
> ============================================================
> ================
> Configure email notifications: https://na01.safelinks.protection.outlook.com/?url=https%3a%2f%2fna01.safelinks&data=01%7c01%7cconniey%40microsoft.com%7cd9eb95fb8bdb44235bff08d3c5e199a2%7c72f988bf86f141af91ab2d7cd011db47%7c1&sdata=rm5avGHU9LYs4h%2bf0MUgM7wiSWL0lNgT6gpYuPB4%2b94%3d.
> protection.outlook.com/?url=http%3a%2f%2fteamcity.
> codebetter.com%2fprofile.html%3finit%3d1%26tab%
> 3duserNotifications&data=01%7c01%7cconniey%40microsoft.com%
> 7cd35b1474747f44a6069608d3c35c6e3c%7c72f988bf86f141af91ab2d7cd011
> db47%7c1&sdata=pVqKXUG9qPQxMxKNA9Btql2Iegivz3%2bkQM4ymx%2fiQkA%3d
>
Mime
View raw message